Peptide,PTM,ModifiedAA,ModifiedPosition,PeptideUniqueToGene,ExperimentDesc,ExpID,PubmedID,ScoreType,IdentScore,LocProb,Log2FChange,PQ-val,QuantSig,PEP,MassErrorPPM
AVTTKADTAASSTSSKPGHE,nt,A,66,true,"Arabidopsis translation initiation landscape - NT",167b,35069635,,,,,,,,
GLADKFGDLR,ac,K,129,false,"Histone deacetylases substrates - hda14 vs WT",98e,29061669,"MaxQuant Score",75.8000000,1.0000000,0.2910000,0.6180164,NO,0.00054999999701977,
GLADKFGDLR,ac,K,129,false,"Quantitative Acetylproteomics",101,29440448,,,,,,,,
GAEHSQRLESYF,nt,G,208,false,"Arabidopsis translation initiation landscape - NT",167b,35069635,,,,,,,,
TLVNKGYDPEVIDIR,ac,K,308,false,"Histone deacetylases- hda14 vs WT (low light)",98c,29061669,"MaxQuant Score",157.8400000,1.0000000,0.6500000,0.9885531,NO,5.8000000358049E-9,
TLVNKGYDPEVIDIR,ac,K,308,false,"Histone deacetylases substrates - hda14 vs WT",98e,29061669,"MaxQuant Score",135.1000000,1.0000000,0.0200000,0.9705100,NO,1.0000000031711E-28,
VLIVEECMR,ox,C,344,false,"OxiTRAQ Arabidopsis - 5 mM H2O2 versus control",47,24376095,,,,0.0385931,0.5630795,NO,,
LSSQDVPTPYAGTLE,nt,L,373,false,"Arg/N-end rule seed, prt6 vs. Wt",99,29168982,"MASCOT Score",34.6200000,,-1.0075563,0.0025482,YES,0.0012349999742582,2.5479291
