Peptide,PTM,ModifiedAA,ModifiedPosition,PeptideUniqueToGene,ExperimentDesc,ExpID,PubmedID,ScoreType,IdentScore,LocProb,Log2FChange,PQ-val,QuantSig,PEP,MassErrorPPM
AVKLSPAASE,nt,A,17,false,"N-terminal ChaFRADIC",92,26010716,"MASCOT Score",49.2600000,,,,,0.093230001628399,
AVKLSPAASE,nta,A,17,false,"N-terminal ChaFRADIC",92,26010716,"MASCOT Score",49.2600000,,,,,0.093230001628399,
VKLSPAASEVFGTGR,nt,V,18,true,"HUNTER N-terminome: legumain, GluC and trypsin",119,31951383,"MaxQuant score",75.9110000,,,,,,
VKLSPAASE,nt,V,18,false,"N-terminal ChaFRADIC",92,26010716,"MASCOT Score",44.6300000,,,,,0.0088210003450513,
VKLSPAASE,nta,V,18,false,"N-terminal ChaFRADIC",92,26010716,"MASCOT Score",44.6300000,,,,,0.0088210003450513,
LSPAASEVFGTGR,ph,T,30,true,"STN8 phosphoproteome",38,21768351,"MASCOT Score",69.0300000,,,,,,-0.8599370
LSPAASEVFGTGR,ph,T,30,true,"Chloroplast kinase substrates",60,19376835,"MASCOT Score",89.4400000,,,,,,-0.7288030
LSPAASEVFGTGR,ph,T,30,true,"atm and atr DNA damage response",88,25561503,"MASCOT Score",68.0000000,1.0000000,,,,,-0.1400000
LSPAASEVFGTGR,ph,T,30,true,"TOR Kinase and ABA Receptor",100,29290610,XCorr,3.4786375,0.9998000,,,,6.2550003349315E-5,
LSPAASEVFGTGR,ph,T,30,true,"Tissue atlas Arabidopsis - ProteomicsDB",114,32188942,"MaxQuant score",157.0700000,0.9999990,,,,1.6956800408252E-9,
LSPAASEVFGTGR,ph,T,30,true,"Touch-induced phosphorylation: 40s touch vs untouc",136,30291188,"MASCOT score",84.2200000,,-0.4717856,0.0023450,YES,,5.0012285
RKASKPTGPSGSPWYGSDR,nt,R,36,true,"FtsH12 N-terminome: WT / FtsH12 knockdown miRNA",118,33216923,"MaxQuant score",107.6600000,,,,,9.3799999949501E-32,
RKASKPTGPSGSPWYGSDR,nt,R,36,true,"HUNTER N-terminome: legumain, GluC and trypsin",119,31951383,"MaxQuant score",93.1520000,,,,,,
RKASKPTGPSGSPWYGSD,nta,R,36,true,"HUNTER N-terminome: legumain, GluC and trypsin",119,31951383,"MaxQuant score",47.9910000,,,,,,
SKPTGPSGSPWYGSDR,nt,S,39,true,"HUNTER N-terminome: legumain, GluC and trypsin",119,31951383,"MaxQuant score",75.3760000,,,,,,
KASKPTGPSGSPWYGSDRVK,ph,S,39,true,"Phosphoproteome ethylene-regulated time response",46,24043427,"MASCOT Score",45.7800000,,,,,,-26.9563000
KASKPTGPSGSPWYGSDR,ph,S,39,true,"Chloroplast kinase substrates",60,19376835,"MASCOT Score",42.2400000,,,,,,-0.5004930
KASKPTGPSGSPWYGSDR,ph,S,39,true,"TOR Kinase and ABA Receptor",100,29290610,XCorr,3.2477779,0.9821000,,,,3.8819998735562E-5,
KASKPTGPSGSPWYGSDR,ph,S,39,true,"Tissue atlas Arabidopsis - ProteomicsDB",114,32188942,"MaxQuant score",135.8000000,0.9988380,,,,4.0421399036359E-15,
ASKPTGPSGSPWYGSDR,ac,K,40,true,"Histone deacetylases - hda14 vs WT (thylakoids)",98d,29061669,"MaxQuant Score",91.3000000,1.0000000,0.6130000,0.7345139,NO,6.3499999702898E-10,
ASKPTGPSGSPWYGSDR,ph,T,42,true,"TOR Kinase and ABA Receptor",100,29290610,XCorr,3.7720747,0.9999000,,,,0.00018390000332147,
ASKPTGPSGSPWYGSDR,ph,T,42,true,"Tissue atlas Arabidopsis - ProteomicsDB",114,32188942,"MaxQuant score",103.2000000,0.9993450,,,,2.5846700282273E-6,
GPSGSPWYGSDR,ph,S,45,false,"atm and atr DNA damage response",88,25561503,"MASCOT Score",58.0000000,0.9950000,,,,,-0.5800000
GPSGSPWYGSDR,ph,S,45,false,"Tissue atlas Arabidopsis - ProteomicsDB",114,32188942,"MaxQuant score",204.8500000,0.9999990,,,,9.0654801420161E-31,
GPSGSPWYGSDR,ph,S,45,false,"Touch-induced phosphorylation: 40s touch vs untouc",136,30291188,"MASCOT score",65.4700000,,-0.0866185,0.2228636,NO,,-0.4423541
ASKPTGPSGSPWYGSDR,ph,S,47,true,"atm and atr DNA damage response",88,25561503,"MASCOT Score",49.0000000,1.0000000,,,,,-0.6400000
ASKPTGPSGSPWYGSDR,ph,S,47,true,"Tissue atlas Arabidopsis - ProteomicsDB",114,32188942,"MaxQuant score",115.3800000,0.9459420,,,,8.0808701952151E-9,
GPSGSPWYGSDRVK,ph,S,47,false,"Phosphoproteome ethylene-regulated time response",46,24043427,"MASCOT Score",82.2100000,,,,,,1.5793000
GPSGSPWYGSDR,ph,S,47,false,"Nitrogen deprivation Ph response",39,22329444,,,,,,,,
GPSGSPWYGSDR,ph,S,47,false,"Tyrosine phosphorylation in Arabidopsis",59,18463617,"MASCOT Score",66.0000000,,,,,,-0.5206347
GPSGSPWYGSDR,ph,S,47,false,"atm and atr DNA damage response",88,25561503,"MASCOT Score",61.0000000,0.9960000,,,,,0.1600000
GPSGSPWYGSDR,ph,S,47,false,"Tissue atlas Arabidopsis - ProteomicsDB",114,32188942,"MaxQuant score",272.5900000,1.0000000,,,,0,
GPSGSPWYGSDR,ph,S,47,false,"Touch-induced phosphorylation: 40s touch vs untouc",136,30291188,"MASCOT score",66.4100000,,-0.1519345,0.1600965,NO,,-0.4423541
GPSGSPWYGSDRVK,ph,Y,50,false,"TOR Kinase and ABA Receptor",100,29290610,XCorr,3.1147344,0.9797000,,,,0.0011520000407472,
GPSGSPWYGSDR,ph,Y,50,false,"atm and atr DNA damage response",88,25561503,"MASCOT Score",55.0000000,0.9280000,,,,,-0.1700000
ASKPTGPSGSPWYGSDRVK,ph,S,52,true,"Phosphoproteome ethylene-regulated time response",46,24043427,"MASCOT Score",30.0700000,,,,,,0.4478500
ASKPTGPSGSPWYGSDR,ph,S,52,true,"Tissue atlas Arabidopsis - ProteomicsDB",114,32188942,"MaxQuant score",112.8200000,0.9996710,,,,1.0972500241735E-8,
GPSGSPWYGSDRVK,ph,S,52,false,"Phosphoproteome ethylene-regulated time response",46,24043427,"MASCOT Score",73.3900000,,,,,,-1.2847000
GPSGSPWYGSDR,ph,S,52,false,"Nitrogen deprivation Ph response",39,22329444,,,,,,,,
GPSGSPWYGSDR,ph,S,52,false,"atm and atr DNA damage response",88,25561503,"MASCOT Score",77.0000000,0.9940000,,,,,0.3200000
GPSGSPWYGSDR,ph,S,52,false,"TOR Kinase and ABA Receptor",100,29290610,XCorr,3.5758910,0.9989000,,,,0.00085559999570251,
GPSGSPWYGSDR,ph,S,52,false,"Tissue atlas Arabidopsis - ProteomicsDB",114,32188942,"MaxQuant score",269.8800000,1.0000000,,,,0,
GPSGSPWYGSDR,ph,S,52,false,"Touch-induced phosphorylation: 40s touch vs untouc",136,30291188,"MASCOT score",69.4200000,,-0.0862119,0.7084524,NO,,4.7639897
GPSGSPWYGSDRVK,ac,K,56,false,"Quantitative Acetylproteomics",101,29440448,,,,,,,,
SGEPPSYLTGEFPGDYGWDTAGLSADPETFAR,nt,S,62,false,"HUNTER N-terminome: legumain, GluC and trypsin",119,31951383,"MaxQuant score",58.6880000,,,,,,
TGEFPGDYGWDTAGLSADPETFARN,nt,T,70,false,"HUNTER N-terminome: legumain, GluC and trypsin",119,31951383,"MaxQuant score",71.6560000,,,,,,
TGEFPGDYGWDTAGLSADPE,nt,T,70,false,"HUNTER N-terminome: legumain, GluC and trypsin",119,31951383,"MaxQuant score",92.7810000,,,,,,
EFPGDYGWDTAGLSADPETFAR,nt,E,72,false,"HUNTER N-terminome: legumain, GluC and trypsin",119,31951383,"MaxQuant score",77.5620000,,,,,,
TAGLSADPETFARN,nt,T,81,false,"HUNTER N-terminome: legumain, GluC and trypsin",119,31951383,"MaxQuant score",140.2400000,,,,,,
TAGLSADPETFAR,nt,T,81,false,"HUNTER N-terminome: legumain, GluC and trypsin",119,31951383,"MaxQuant score",126.6700000,,,,,,
TAGLSADPETFAR,nta,T,81,false,"FtsH12 N-terminome: WT / FtsH12 knockdown miRNA",118,33216923,"MaxQuant score",96.1130000,,,,,0.0055354000069201,
ELEVIHSR,ph,S,102,false,"atm and atr DNA damage response",88,25561503,"MASCOT Score",53.0000000,1.0000000,,,,,-0.4300000
NGVKFGEAVWFK,ac,K,124,false,"Lysine acetylation gel-based Finkemeier et al",37,21311031,i-probability,0.7437590,,,,,,
NGVKFGEAVWFK,ac,K,124,false,"Histone deacetylases - hda14 vs WT (thylakoids)",98d,29061669,"MaxQuant Score",53.4000000,1.0000000,-0.0020000,0.9977001,NO,0.012000000104308,
TQVILMGAVEGYR,nt,T,163,false,"HUNTER N-terminome: legumain, GluC and trypsin",119,31951383,"MaxQuant score",77.6400000,,,,,,
SFDPLGLATDPE,nt,S,194,false,"HUNTER N-terminome: legumain, GluC and trypsin",119,31951383,"MaxQuant score",85.7310000,,,,,,
TDPEAFAELKVKELKN,nt,T,202,false,"HUNTER N-terminome: legumain, GluC and trypsin",119,31951383,"MaxQuant score",80.5340000,,,,,,
