Peptide,PTM,ModifiedAA,ModifiedPosition,PeptideUniqueToGene,ExperimentDesc,ExpID,PubmedID,ScoreType,IdentScore,LocProb,Log2FChange,PQ-val,QuantSig,PEP,MassErrorPPM
ASSTMALSSPAFAGKAVKPAASDVLGSGR,nta,A,2,true,"HUNTER N-terminome: legumain, GluC and trypsin",119,31951383,"MaxQuant score",65.1550000,,,,,,
ALSSPAFAGKAVKPAASD,nta,A,7,true,"HUNTER N-terminome: legumain, GluC and trypsin",119,31951383,"MaxQuant score",,,,,,,
AGKAVKPAASDVLGSGR,nt,A,14,true,"HUNTER N-terminome: legumain, GluC and trypsin",119,31951383,"MaxQuant score",89.8660000,,,,,,
AVKPAASDVLGSGR,nt,A,17,true,"HUNTER N-terminome: legumain, GluC and trypsin",119,31951383,"MaxQuant score",55.1860000,,,,,,
AVKPAASDVLGSGR,ph,S,28,true,"Large-scale phosphorylation discovery",44,23111157,XCorr,3.6870000,,,,,,
AVKPAASDVLGSGR,ph,S,28,true,"atm and atr DNA damage response",88,25561503,"MASCOT Score",34.0000000,1.0000000,,,,,-0.1500000
AVKPAASDVLGSGR,ph,S,28,true,"Tissue atlas Arabidopsis - ProteomicsDB",114,32188942,"MaxQuant score",96.8810000,0.9707990,,,,1.4395900507225E-6,
RKTVAKPKGPSGSPWYGSDR,nt,R,34,false,"Stromal N-terminome",96,26371235,"MASCOT Score",45.1300000,,,,,,
RKTVAKPKGPSGSPWYGSDR,nt,R,34,false,"FtsH12 N-terminome: WT / FtsH12 knockdown miRNA",118,33216923,"MaxQuant score",97.4310000,,-0.1198237,0.3890504,NO,2.6700000768277E-22,
RKTVAKPKGPSGSPWYGSD,nt,R,34,false,"HUNTER N-terminome: legumain, GluC and trypsin",119,31951383,"MaxQuant score",71.6970000,,,,,,
RKTVAKPKGPSGSPWYGSDR,nta,R,34,false,"Stromal N-terminome",96,26371235,"MASCOT Score",45.1300000,,,,,,
RKTVAKPKGPSGSPWYGSDR,nta,R,34,false,"HUNTER N-terminome: legumain, GluC and trypsin",119,31951383,"MaxQuant score",97.2710000,,,,,,
RKTVAKPKGPSGSPWYGSD,nta,R,34,false,"HUNTER N-terminome: legumain, GluC and trypsin",119,31951383,"MaxQuant score",52.4950000,,,,,,
RKTVAKPKGPSGSPWYGSDRVKYLGPFSGE,ac,K,35,false,"Lysine acetylation gel-based Arabidopsis",36,21311030,"MASCOT Score",82.0000000,,,,,,-0.4995000
RKTVAKPKGPSGSPWYGSD,ac,K,35,false,"Lysine acetylation gel-based Arabidopsis",36,21311030,"MASCOT Score",44.0000000,,,,,,-0.3799000
KTVAKPKGPSGSPWYGSDR,nt,K,35,false,"FtsH12 N-terminome: WT / FtsH12 knockdown miRNA",118,33216923,"MaxQuant score",164.5300000,,-0.4829725,0.0012916,NO,0,
TVAKPKGPSGSPWYGSDRVK,fuc,T,36,false,"SPINDLY O-fucosylation",162,36739885,,,,,,,0.75,
TVAKPKGPSGSPWYGSD,nt,T,36,false,"HUNTER N-terminome: legumain, GluC and trypsin",119,31951383,"MaxQuant score",60.9180000,,,,,,
TVAKPKGPSGSPWYGSDRVK,ph,T,36,false,"Phosphoproteome ethylene-regulated time response",46,24043427,"MASCOT Score",89.2000000,,,,,,-5.5305000
TVAKPKGPSGSPWYGSDR,ph,T,36,false,"Phosphoproteome ethylene-regulated time response",46,24043427,"MASCOT Score",133.7700000,,,,,,-12.3056000
TVAKPKGPSGSPWYGSDR,ph,T,36,false,"Tissue atlas Arabidopsis - ProteomicsDB",114,32188942,"MaxQuant score",107.8800000,0.9999990,,,,1.3343699478696E-9,
KTVAKPK,ac,K,39,false,"Quantitative Acetylproteomics",101,29440448,,,,,,,,
TVAKPKGPSGSPWYGSDR,ac,K,41,false,"Histone deacetylases - hda14 vs WT (thylakoids)",98d,29061669,"MaxQuant Score",105.9000000,0.9580000,1.0000000,0.4092607,NO,1.0399999953023E-13,
GPSGSPWYGSDR,ph,S,44,false,"atm and atr DNA damage response",88,25561503,"MASCOT Score",58.0000000,0.9950000,,,,,-0.5800000
GPSGSPWYGSDR,ph,S,44,false,"Tissue atlas Arabidopsis - ProteomicsDB",114,32188942,"MaxQuant score",204.8500000,0.9999990,,,,9.0654801420161E-31,
GPSGSPWYGSDR,ph,S,44,false,"Touch-induced phosphorylation: 40s touch vs untouc",136,30291188,"MASCOT score",65.4700000,,-0.0866185,0.2228636,NO,,-0.4423541
GPSGSPWYGSDRVK,ph,S,46,false,"Phosphoproteome ethylene-regulated time response",46,24043427,"MASCOT Score",82.2100000,,,,,,1.5793000
GPSGSPWYGSDR,ph,S,46,false,"Nitrogen deprivation Ph response",39,22329444,,,,,,,,
GPSGSPWYGSDR,ph,S,46,false,"Tyrosine phosphorylation in Arabidopsis",59,18463617,"MASCOT Score",66.0000000,,,,,,-0.5206347
GPSGSPWYGSDR,ph,S,46,false,"atm and atr DNA damage response",88,25561503,"MASCOT Score",61.0000000,0.9960000,,,,,0.1600000
GPSGSPWYGSDR,ph,S,46,false,"Tissue atlas Arabidopsis - ProteomicsDB",114,32188942,"MaxQuant score",272.5900000,1.0000000,,,,0,
GPSGSPWYGSDR,ph,S,46,false,"Touch-induced phosphorylation: 40s touch vs untouc",136,30291188,"MASCOT score",66.4100000,,-0.1519345,0.1600965,NO,,-0.4423541
GPSGSPWYGSDRVK,ph,Y,49,false,"TOR Kinase and ABA Receptor",100,29290610,XCorr,3.1147344,0.9797000,,,,0.0011520000407472,
GPSGSPWYGSDR,ph,Y,49,false,"atm and atr DNA damage response",88,25561503,"MASCOT Score",55.0000000,0.9280000,,,,,-0.1700000
GPSGSPWYGSDRVK,ph,S,51,false,"Phosphoproteome ethylene-regulated time response",46,24043427,"MASCOT Score",73.3900000,,,,,,-1.2847000
GPSGSPWYGSDR,ph,S,51,false,"Nitrogen deprivation Ph response",39,22329444,,,,,,,,
GPSGSPWYGSDR,ph,S,51,false,"atm and atr DNA damage response",88,25561503,"MASCOT Score",77.0000000,0.9940000,,,,,0.3200000
GPSGSPWYGSDR,ph,S,51,false,"TOR Kinase and ABA Receptor",100,29290610,XCorr,3.5758910,0.9989000,,,,0.00085559999570251,
GPSGSPWYGSDR,ph,S,51,false,"Tissue atlas Arabidopsis - ProteomicsDB",114,32188942,"MaxQuant score",269.8800000,1.0000000,,,,0,
GPSGSPWYGSDR,ph,S,51,false,"Touch-induced phosphorylation: 40s touch vs untouc",136,30291188,"MASCOT score",69.4200000,,-0.0862119,0.7084524,NO,,4.7639897
GPSGSPWYGSDRVK,ac,K,55,false,"Quantitative Acetylproteomics",101,29440448,,,,,,,,
SGEPPSYLTGEFPGDYGWDTAGLSADPETFAR,nt,S,61,false,"HUNTER N-terminome: legumain, GluC and trypsin",119,31951383,"MaxQuant score",58.6880000,,,,,,
TGEFPGDYGWDTAGLSADPETFARN,nt,T,69,false,"HUNTER N-terminome: legumain, GluC and trypsin",119,31951383,"MaxQuant score",71.6560000,,,,,,
TGEFPGDYGWDTAGLSADPE,nt,T,69,false,"HUNTER N-terminome: legumain, GluC and trypsin",119,31951383,"MaxQuant score",92.7810000,,,,,,
EFPGDYGWDTAGLSADPETFAR,nt,E,71,false,"HUNTER N-terminome: legumain, GluC and trypsin",119,31951383,"MaxQuant score",77.5620000,,,,,,
TAGLSADPETFARN,nt,T,80,false,"HUNTER N-terminome: legumain, GluC and trypsin",119,31951383,"MaxQuant score",140.2400000,,,,,,
TAGLSADPETFAR,nt,T,80,false,"HUNTER N-terminome: legumain, GluC and trypsin",119,31951383,"MaxQuant score",126.6700000,,,,,,
TAGLSADPETFAR,nta,T,80,false,"FtsH12 N-terminome: WT / FtsH12 knockdown miRNA",118,33216923,"MaxQuant score",96.1130000,,,,,0.0055354000069201,
ELEVIHSR,ph,S,101,false,"atm and atr DNA damage response",88,25561503,"MASCOT Score",53.0000000,1.0000000,,,,,-0.4300000
NGVKFGEAVWFK,ac,K,123,false,"Lysine acetylation gel-based Finkemeier et al",37,21311031,i-probability,0.7437590,,,,,,
NGVKFGEAVWFK,ac,K,123,false,"Histone deacetylases - hda14 vs WT (thylakoids)",98d,29061669,"MaxQuant Score",53.4000000,1.0000000,-0.0020000,0.9977001,NO,0.012000000104308,
TQVILMGAVEGYR,nt,T,162,false,"HUNTER N-terminome: legumain, GluC and trypsin",119,31951383,"MaxQuant score",77.6400000,,,,,,
SFDPLGLATDPE,nt,S,193,false,"HUNTER N-terminome: legumain, GluC and trypsin",119,31951383,"MaxQuant score",85.7310000,,,,,,
TDPEAFAELKVKELKN,nt,T,201,false,"HUNTER N-terminome: legumain, GluC and trypsin",119,31951383,"MaxQuant score",80.5340000,,,,,,
