Peptide,PTM,ModifiedAA,ModifiedPosition,PeptideUniqueToGene,ExperimentDesc,ExpID,PubmedID,ScoreType,IdentScore,LocProb,Log2FChange,PQ-val,QuantSig,PEP,MassErrorPPM
SATPECLISGLK,sno,C,134,true,"hot5-4 / wildtype, FAT-switch S-nitrosoproteome",169,37277371,,,,,,,,
DLCVVK,sno,C,335,true,"hot5-4 / wildtype, FAT-switch S-nitrosoproteome",169,37277371,,,,1.3050151,0.0001217,YES,,
TAIAQDESPVSGMDVDNTADK,ph,S,707,true,"Conserved plant phosphoproteome - Arabidopsis",61a,20466843,"MASCOT Score",93.0000000,1.0000000,,,,,
TAIAQDESPVSGMDVDNTADK,ph,S,707,true,"TOR Kinase and ABA Receptor",100,29290610,XCorr,5.7262506,0.9794000,,,,1.6129999558245E-9,
TAIAQDESPVSGMDVDNTADK,ph,S,707,true,"Phospho cell culture sucrose/TOR",109,30833711,,,0.9992560,,,,,
TAIAQDESPVSGMDVDNTADK,ph,S,707,true,"Tissue atlas Arabidopsis - ProteomicsDB",114,32188942,"MaxQuant score",399.0900000,1.0000000,,,,0,
KDIVSSFLPEVILALK,ph,S,831,true,"Phospho cell culture sucrose/TOR",109,30833711,,,1.0000000,,,,,
CGTEAVK,sno,C,990,true,"hot5-4 / wildtype, FAT-switch S-nitrosoproteome",169,37277371,,,,,,,,
YAAGSDISK,ph,S,1025,true,"TOR Kinase and ABA Receptor",100,29290610,XCorr,2.4974167,0.9993000,,,,0.010040000081062,
YAAGSDISK,ph,S,1025,true,"Tissue atlas Arabidopsis - ProteomicsDB",114,32188942,"MaxQuant score",90.6530000,0.9981180,,,,0.0022854099515826,
IFSDVYADSEDSDGDDMDAESHGR,ph,Y,1053,true,"Brassinosteroid-Regulated Phosphorylation Dynamics",94,26187819,"MaxQuant Score",100.9300000,0.9600000,,,,2.3610000425833E-6,0.3400000
IFSDVYADSEDSDGDDMDAESHGR,ph,S,1056,true,"srk2dei ABA signaling phopshoproteomics",83,23572148,"MASCOT Score",48.0000000,,,,,,-0.0007000
IFSDVYADSEDSDGDDMDAESHGR,ph,S,1056,true,"SnRK2 protein kinase substrates",85,23776212,XCorr,2.9388433,0.9980000,,,,4.4425999286805E-16,
IFSDVYADSEDSDGDDMDAESHGR,ph,S,1056,true,"Brassinosteroid-Regulated Phosphorylation Dynamics",94,26187819,"MaxQuant Score",116.4900000,1.0000000,,,,1.8680000601901E-10,0.4300000
IFSDVYADSEDSDGDDMDAESHGR,ph,S,1056,true,"TOR Kinase and ABA Receptor",100,29290610,XCorr,5.3564682,0.9992000,,,,7.6389997047954E-6,
IFSDVYADSEDSDGDDMDAESHGR,ph,S,1056,true,"Lateral root-induction - NAA vs control",106,23328941,"MASCOT Score",40.0000000,,,,,,
IFSDVYADSEDSDGDDMDAESHGR,ph,S,1059,true,"srk2dei ABA signaling phopshoproteomics",83,23572148,"MASCOT Score",48.0000000,,,,,,-0.0007000
IFSDVYADSEDSDGDDMDAESHGR,ph,S,1059,true,"SnRK2 protein kinase substrates",85,23776212,XCorr,4.2356753,0.9970000,,,,3.96250006599E-16,
IFSDVYADSEDSDGDDMDAESHGR,ph,S,1059,true,"Brassinosteroid-Regulated Phosphorylation Dynamics",94,26187819,"MaxQuant Score",116.4900000,1.0000000,,,,1.8680000601901E-10,0.4300000
IFSDVYADSEDSDGDDMDAESHGR,ph,S,1059,true,"TOR Kinase and ABA Receptor",100,29290610,XCorr,5.3564682,1.0000000,,,,7.6389997047954E-6,
IFSDVYADSEDSDGDDMDAESHGR,ph,S,1059,true,"Lateral root-induction - NAA vs control",106,23328941,"MASCOT Score",40.0000000,,,,,,
SKASSLLK,ph,S,1075,true,"Tissue atlas Arabidopsis - ProteomicsDB",114,32188942,"MaxQuant score",68.5630000,0.9998020,,,,0.013299100100994,
SKASSLLK,ph,S,1076,true,"Tissue atlas Arabidopsis - ProteomicsDB",114,32188942,"MaxQuant score",68.5630000,0.9998000,,,,0.013299100100994,
ASSLLKSKASALR,ph,S,1080,true,"SIRK1 phosphorylation",86a,23820729,"MaxQuant Score",139.1700000,1.0000000,,,,0.0049999998882413,1.8130000
ASSLLKSKASALR,ph,S,1083,true,"SIRK1 phosphorylation",86a,23820729,"MaxQuant Score",139.1700000,1.0000000,,,,0.0049999998882413,1.8130000
SRNQSHLEVDESDDEPLDLMDQHK,ph,S,1101,true,"TOR Kinase and ABA Receptor",100,29290610,XCorr,5.4529600,0.9998000,,,,2.3760000544826E-7,
NQSHLEVDESDDEPLDLMDQHK,ph,S,1101,true,"Arabidopsis root NAA phosphoproteome",18a,27643528,"MaxQuant Score",117.9400000,1.0000000,,,,2.0290000099278E-18,-1.1620000
NQSHLEVDESDDEPLDLMDQHK,ph,S,1101,true,"Large-scale phosphorylation discovery",44,23111157,XCorr,5.9790000,,,,,,
NQSHLEVDESDDEPLDLMDQHK,ph,S,1101,true,"PAMP-triggered phosphorylation",48,24601666,"MASCOT Score",31.9800000,,,,,,
NQSHLEVDESDDEPLDLMDQHK,ph,S,1101,true,"srk2dei ABA signaling phopshoproteomics",83,23572148,"MASCOT Score",48.0000000,,,,,,0.0022000
NQSHLEVDESDDEPLDLMDQHK,ph,S,1101,true,"SnRK2 protein kinase substrates",85,23776212,XCorr,4.5533423,1.0000000,,,,3.96250006599E-16,
NQSHLEVDESDDEPLDLMDQHK,ph,S,1101,true,"atm and atr DNA damage response",88,25561503,"MASCOT Score",57.0000000,1.0000000,,,,,-1.0600000
NQSHLEVDESDDEPLDLMDQHK,ph,S,1101,true,"TOR Kinase and ABA Receptor",100,29290610,XCorr,5.5665374,0.9886000,,,,5.4819997785671E-7,
NQSHLEVDESDDEPLDLMDQHK,ph,S,1101,true,"Phospho cell culture sucrose/TOR",109,30833711,,,1.0000000,,,,,
NQSHLEVDESDDEPLDLMDQHK,ph,S,1101,true,"Col-0 callus - FC Col-0 vs. Col-0 Xray",111a,31410901,,40.9500000,,0.7085672,0.0000000,NO,,0.3974270
NQSHLEVDESDDEPLDLMDQHK,ph,S,1101,true,"Col-0 X-ray callus - FC Col-0 vs. Col-0 Xray",111b,31410901,,40.9500000,,0.7085672,0.0000000,NO,,0.3974270
NQSHLEVDESDDEPLDLMDQHK,ph,S,1101,true,"atm callus - FC atm vs. atm Xray",111c,31410901,,40.9500000,,0.4499938,0.0000000,NO,,0.3974270
NQSHLEVDESDDEPLDLMDQHK,ph,S,1101,true,"atm-3 X-ray callus - FC atm vs. atm Xray",111d,31410901,,40.9500000,,0.4499938,0.0000000,NO,,0.3974270
NQSHLEVDESDDEPLDLMDQHK,ph,S,1101,true,"Tissue atlas Arabidopsis - ProteomicsDB",114,32188942,"MaxQuant score",349.0500000,1.0000000,,,,0,
RKADSDEEAEFDVEGR,ph,S,1130,true,"Arabidopsis root NAA phosphoproteome",18a,27643528,"MaxQuant Score",122.5300000,1.0000000,,,,2.3780000007911E-17,-0.9110000
RKADSDEEAEFDVEGR,ph,S,1130,true,"Tyrosine phosphorylation in Arabidopsis",59,18463617,"MASCOT Score",72.0000000,,,,,,-0.2588274
RKADSDEEAEFDVEGR,ph,S,1130,true,"srk2dei ABA signaling phopshoproteomics",83,23572148,"MASCOT Score",79.0000000,,,,,,0.0008000
RKADSDEEAEFDVEGR,ph,S,1130,true,"Brassinosteroid-Regulated Phosphorylation Dynamics",94,26187819,"MaxQuant Score",169.2500000,1.0000000,,,,6.5861027823266E-44,4.4480000
RKADSDEEAEFDVEGR,ph,S,1130,true,"TOR Kinase and ABA Receptor",100,29290610,XCorr,4.7765393,1.0000000,,,,2.066999940098E-7,
RKADSDEEAEFDVEGR,ph,S,1130,true,"Phospho cell culture sucrose/TOR",109,30833711,,,1.0000000,,,,,
RKADSDEEAEFDVEGR,ph,S,1130,true,"Tissue atlas Arabidopsis - ProteomicsDB",114,32188942,"MaxQuant score",374.0300000,1.0000000,,,,0,
KADSDEEAEFDVEGR,ph,S,1130,true,"STN8 phosphoproteome",38,21768351,"MASCOT Score",133.1100000,,,,,,-0.8822520
KADSDEEAEFDVEGR,ph,S,1130,true,"Large-scale phosphorylation discovery",44,23111157,XCorr,3.8750000,,,,,,
KADSDEEAEFDVEGR,ph,S,1130,true,"Tyrosine phosphorylation in Arabidopsis",59,18463617,"MASCOT Score",99.0000000,,,,,,-1.4642228
KADSDEEAEFDVEGR,ph,S,1130,true,"Chloroplast kinase substrates",60,19376835,"MASCOT Score",116.5100000,,,,,,-0.5672390
KADSDEEAEFDVEGR,ph,S,1130,true,"LAXIC - mannitol vs control",84b,23660473,XCorr,5.6200000,1.0000000,-1.0487442,,NO,0.00062940100906417,
KADSDEEAEFDVEGR,ph,S,1130,true,"SnRK2 protein kinase substrates",85,23776212,XCorr,5.3970413,1.0000000,,,,3.96250006599E-16,
KADSDEEAEFDVEGR,ph,S,1130,true,"atm and atr DNA damage response",88,25561503,"MASCOT Score",85.0000000,1.0000000,,,,,-0.2300000
KADSDEEAEFDVEGR,ph,S,1130,true,"TOR Kinase and ABA Receptor",100,29290610,XCorr,5.7648063,1.0000000,,,,1.5070000358719E-7,
KADSDEEAEFDVEGR,ph,S,1130,true,"Col-0 callus - FC Col-0 vs. Col-0 Xray",111a,31410901,,108.0000000,,0.3315929,0.0000000,NO,,1.1080944
KADSDEEAEFDVEGR,ph,S,1130,true,"Col-0 X-ray callus - FC Col-0 vs. Col-0 Xray",111b,31410901,,108.0000000,,0.3315929,0.0000000,NO,,1.1080944
KADSDEEAEFDVEGR,ph,S,1130,true,"atm callus - FC atm vs. atm Xray",111c,31410901,,108.0000000,,0.1745062,0.0000000,NO,,1.1080944
KADSDEEAEFDVEGR,ph,S,1130,true,"atm-3 X-ray callus - FC atm vs. atm Xray",111d,31410901,,108.0000000,,0.1745062,0.0000000,NO,,1.1080944
KADSDEEAEFDVEGR,ph,S,1130,true,"Touch-induced phosphorylation: 40s touch vs untouc",136,30291188,"MASCOT score",133.6100000,,0.1183260,0.7084524,NO,,0.3448430
ADSDEEAEFDVEGR,ph,S,1130,true,"STN8 phosphoproteome",38,21768351,"MASCOT Score",67.8800000,,,,,,-1.0738200
ADSDEEAEFDVEGR,ph,S,1130,true,"Large-scale phosphorylation discovery",44,23111157,XCorr,4.5720000,,,,,,
ADSDEEAEFDVEGR,ph,S,1130,true,"Tyrosine phosphorylation in Arabidopsis",59,18463617,"MASCOT Score",73.0000000,,,,,,-1.3959771
ADSDEEAEFDVEGR,ph,S,1130,true,"SnRK2 protein kinase substrates",85,23776212,XCorr,3.0374291,1.0000000,,,,0.00077854102710262,
ADSDEEAEFDVEGR,ph,S,1130,true,"atm and atr DNA damage response",88,25561503,"MASCOT Score",72.0000000,1.0000000,,,,,-0.0100000
ADSDEEAEFDVEGR,ph,S,1130,true,"TOR Kinase and ABA Receptor",100,29290610,XCorr,5.4390659,1.0000000,,,,1.0779999826127E-7,
MKTSESGYAYTGK,ph,S,1185,true,"atm and atr DNA damage response",88,25561503,"MASCOT Score",58.0000000,0.9920000,,,,,-1.8600000
MKTSESGYAYTGK,ph,S,1185,true,"Tissue atlas Arabidopsis - ProteomicsDB",114,32188942,"MaxQuant score",164.7700000,0.9964600,,,,1.5162600341956E-10,
