Peptide,PTM,ModifiedAA,ModifiedPosition,PeptideUniqueToGene,ExperimentDesc,ExpID,PubmedID,ScoreType,IdentScore,LocProb,Log2FChange,PQ-val,QuantSig,PEP,MassErrorPPM
TVAAVAGSPGTPTTPGSAR,ph,T,38,true,"srk2dei ABA signaling phopshoproteomics",83,23572148,"MASCOT Score",49.0000000,,,,,,-0.0005000
TVAAVAGSPGTPTTPGSARK,ph,S,45,true,"STN8 phosphoproteome",38,21768351,"MASCOT Score",47.5900000,,,,,,0.7332900
TVAAVAGSPGTPTTPGSARK,ph,S,45,true,"Chloroplast kinase substrates",60,19376835,"MASCOT Score",46.1300000,,,,,,0.7332900
TVAAVAGSPGTPTTPGSARK,ph,S,45,true,"srk2dei ABA signaling phopshoproteomics",83,23572148,"MASCOT Score",42.0000000,,,,,,-0.0009000
TVAAVAGSPGTPTTPGSARK,ph,S,45,true,"TOR Kinase and ABA Receptor",100,29290610,XCorr,2.1375051,0.9684000,,,,0.012609999626875,
TVAAVAGSPGTPTTPGSAR,ph,S,45,true,"Large-scale phosphorylation discovery",44,23111157,XCorr,2.9420000,,,,,,
TVAAVAGSPGTPTTPGSAR,ph,S,45,true,"PAMP-triggered phosphorylation",48,24601666,"MASCOT Score",41.6700000,,,,,,
TVAAVAGSPGTPTTPGSAR,ph,S,45,true,"Chloroplast kinase substrates",60,19376835,"MASCOT Score",38.0600000,,,,,,-1.4505900
TVAAVAGSPGTPTTPGSAR,ph,S,45,true,"BSK8 and BSL2 regulating sucrose-ph synthase",66,24924143,"MaxQuant Score",142.2300000,,,,,,-0.4158600
TVAAVAGSPGTPTTPGSAR,ph,S,45,true,"srk2dei ABA signaling phopshoproteomics",83,23572148,"MASCOT Score",85.0000000,,,,,,-0.0004000
TVAAVAGSPGTPTTPGSAR,ph,S,45,true,"LAXIC - mannitol vs control",84b,23660473,XCorr,5.1800000,0.9940000,-1.6039137,,NO,4.5299999328563E-5,
TVAAVAGSPGTPTTPGSAR,ph,S,45,true,"SnRK2 protein kinase substrates",85,23776212,XCorr,5.1142030,0.9390000,,,,1.6725300611142E-7,
TVAAVAGSPGTPTTPGSAR,ph,S,45,true,"atm and atr DNA damage response",88,25561503,"MASCOT Score",73.0000000,0.9130000,,,,,-0.1600000
TVAAVAGSPGTPTTPGSAR,ph,S,45,true,"Lateral root-induction - NAA vs control",106,23328941,"MASCOT Score",35.0000000,,,,,,
TVAAVAGSPGTPTTPGSAR,ph,S,45,true,"Phospho cell culture sucrose/TOR",109,30833711,,,0.9996760,,,,,
TVAAVAGSPGTPTTPGSAR,ph,S,45,true,"Col-0 callus - FC Col-0 vs. Col-0 Xray",111a,31410901,,69.3100000,,-1.2173540,0.0000000,NO,,1.1495642
TVAAVAGSPGTPTTPGSAR,ph,S,45,true,"Col-0 X-ray callus - FC Col-0 vs. Col-0 Xray",111b,31410901,,69.3100000,,-1.2173540,0.0000000,NO,,1.1495642
TVAAVAGSPGTPTTPGSAR,ph,S,45,true,"atm callus - FC atm vs. atm Xray",111c,31410901,,69.3100000,,-0.1997558,0.0000000,NO,,1.1495642
TVAAVAGSPGTPTTPGSAR,ph,S,45,true,"atm-3 X-ray callus - FC atm vs. atm Xray",111d,31410901,,69.3100000,,-0.1997558,0.0000000,NO,,1.1495642
TVAAVAGSPGTPTTPGSAR,ph,S,45,true,"Tissue atlas Arabidopsis - ProteomicsDB",114,32188942,"MaxQuant score",342.9700000,1.0000000,,,,0,
TVAAVAGSPGTPTTPGSARK,ph,T,48,true,"srk2dei ABA signaling phopshoproteomics",83,23572148,"MASCOT Score",42.0000000,,,,,,-0.0005000
TVAAVAGSPGTPTTPGSAR,ph,T,48,true,"srk2dei ABA signaling phopshoproteomics",83,23572148,"MASCOT Score",76.0000000,,,,,,-0.0006000
TVAAVAGSPGTPTTPGSAR,ph,T,48,true,"LAXIC - ABA stress",84a,23660473,XCorr,4.8100000,0.8490000,,,,1.7699999688148E-8,
TVAAVAGSPGTPTTPGSAR,ph,T,48,true,"SnRK2 protein kinase substrates",85,23776212,XCorr,4.3685856,0.9420000,,,,1.8847300022745E-12,
TVAAVAGSPGTPTTPGSAR,ph,T,48,true,"atm and atr DNA damage response",88,25561503,"MASCOT Score",60.0000000,0.9940000,,,,,-0.9500000
TVAAVAGSPGTPTTPGSAR,ph,T,48,true,"Protein sumoylation and phosphorylation cross-talk",97,28419593,,,,,,,,
TVAAVAGSPGTPTTPGSAR,ph,T,48,true,"Lateral root-induction - NAA vs control",106,23328941,"MASCOT Score",49.0000000,,0.7990217,0.0012668,YES,,
TVAAVAGSPGTPTTPGSAR,ph,T,48,true,"Col-0 callus - FC Col-0 vs. Col-0 Xray",111a,31410901,,35.3500000,,-0.3197724,0.0000000,NO,,1.2411452
TVAAVAGSPGTPTTPGSAR,ph,T,48,true,"Col-0 X-ray callus - FC Col-0 vs. Col-0 Xray",111b,31410901,,35.3500000,,-0.3197724,0.0000000,NO,,1.2411452
TVAAVAGSPGTPTTPGSAR,ph,T,48,true,"atm callus - FC atm vs. atm Xray",111c,31410901,,35.3500000,,-3.4734494,0.0000000,NO,,1.2411452
TVAAVAGSPGTPTTPGSAR,ph,T,48,true,"atm-3 X-ray callus - FC atm vs. atm Xray",111d,31410901,,35.3500000,,-3.4734494,0.0000000,NO,,1.2411452
TVAAVAGSPGTPTTPGSAR,ph,T,48,true,"Tissue atlas Arabidopsis - ProteomicsDB",114,32188942,"MaxQuant score",290.1800000,0.9997130,,,,0,
TVAAVAGSPGTPTTPGSARK,ph,T,50,true,"srk2dei ABA signaling phopshoproteomics",83,23572148,"MASCOT Score",42.0000000,,,,,,-0.0005000
TVAAVAGSPGTPTTPGSARK,ph,T,50,true,"Tissue atlas Arabidopsis - ProteomicsDB",114,32188942,"MaxQuant score",289.1000000,0.9895470,,,,0,
TVAAVAGSPGTPTTPGSAR,ph,T,50,true,"srk2dei ABA signaling phopshoproteomics",83,23572148,"MASCOT Score",80.0000000,,,,,,-0.0002000
TVAAVAGSPGTPTTPGSAR,ph,T,50,true,"atm and atr DNA damage response",88,25561503,"MASCOT Score",57.0000000,0.9920000,,,,,-0.0500000
TVAAVAGSPGTPTTPGSAR,ph,T,50,true,"Lateral root-induction - NAA vs control",106,23328941,"MASCOT Score",36.0000000,,0.7784005,0.0017013,YES,,
TVAAVAGSPGTPTTPGSAR,ph,T,50,true,"Col-0 callus - FC Col-0 vs. Col-0 Xray",111a,31410901,,35.3500000,,-0.3197724,0.0000000,NO,,1.2411452
TVAAVAGSPGTPTTPGSAR,ph,T,50,true,"Col-0 X-ray callus - FC Col-0 vs. Col-0 Xray",111b,31410901,,35.3500000,,-0.3197724,0.0000000,NO,,1.2411452
TVAAVAGSPGTPTTPGSAR,ph,T,50,true,"atm callus - FC atm vs. atm Xray",111c,31410901,,35.3500000,,-3.4734494,0.0000000,NO,,1.2411452
TVAAVAGSPGTPTTPGSAR,ph,T,50,true,"atm-3 X-ray callus - FC atm vs. atm Xray",111d,31410901,,35.3500000,,-3.4734494,0.0000000,NO,,1.2411452
TVAAVAGSPGTPTTPGSARK,ph,T,51,true,"srk2dei ABA signaling phopshoproteomics",83,23572148,"MASCOT Score",60.0000000,,,,,,-0.0010000
TVAAVAGSPGTPTTPGSAR,ph,T,51,true,"Large-scale phosphorylation discovery",44,23111157,XCorr,5.0210000,,,,,,
TVAAVAGSPGTPTTPGSAR,ph,T,51,true,"PAMP-triggered phosphorylation",48,24601666,"MASCOT Score",41.6700000,,,,,,
TVAAVAGSPGTPTTPGSAR,ph,T,51,true,"srk2dei ABA signaling phopshoproteomics",83,23572148,"MASCOT Score",76.0000000,,,,,,0.0005000
TVAAVAGSPGTPTTPGSAR,ph,T,51,true,"LAXIC - ABA stress",84a,23660473,XCorr,5.3800000,0.9930000,,,,7.3499997199633E-8,
TVAAVAGSPGTPTTPGSAR,ph,T,51,true,"SnRK2 protein kinase substrates",85,23776212,XCorr,5.1674271,0.9970000,,,,3.5664698971871E-10,
TVAAVAGSPGTPTTPGSAR,ph,T,51,true,"atm and atr DNA damage response",88,25561503,"MASCOT Score",62.0000000,0.9300000,,,,,0.1400000
TVAAVAGSPGTPTTPGSAR,ph,T,51,true,"Protein sumoylation and phosphorylation cross-talk",97,28419593,,,,,,,,
TVAAVAGSPGTPTTPGSAR,ph,T,51,true,"Lateral root-induction - NAA vs control",106,23328941,"MASCOT Score",21.0000000,,,,,,
TVAAVAGSPGTPTTPGSAR,ph,T,51,true,"Col-0 callus - FC Col-0 vs. Col-0 Xray",111a,31410901,,72.3100000,,-1.0313098,0.0000000,NO,,1.0676816
TVAAVAGSPGTPTTPGSAR,ph,T,51,true,"Col-0 X-ray callus - FC Col-0 vs. Col-0 Xray",111b,31410901,,72.3100000,,-1.0313098,0.0000000,NO,,1.0676816
TVAAVAGSPGTPTTPGSAR,ph,T,51,true,"atm callus - FC atm vs. atm Xray",111c,31410901,,72.3100000,,-0.2430066,0.0000000,NO,,1.0676816
TVAAVAGSPGTPTTPGSAR,ph,T,51,true,"atm-3 X-ray callus - FC atm vs. atm Xray",111d,31410901,,72.3100000,,-0.2430066,0.0000000,NO,,1.0676816
TVAAVAGSPGTPTTPGSAR,ph,T,51,true,"Tissue atlas Arabidopsis - ProteomicsDB",114,32188942,"MaxQuant score",331.0700000,0.9969680,,,,0,
TVAAVAGSPGTPTTPGSARK,ph,S,54,true,"srk2dei ABA signaling phopshoproteomics",83,23572148,"MASCOT Score",64.0000000,,,,,,-0.0025000
TVAAVAGSPGTPTTPGSARK,ph,S,54,true,"Col-0 callus - FC Col-0 vs. Col-0 Xray",111a,31410901,,21.2500000,,-2.0294922,0.0000000,NO,,0.1190728
TVAAVAGSPGTPTTPGSARK,ph,S,54,true,"Col-0 X-ray callus - FC Col-0 vs. Col-0 Xray",111b,31410901,,21.2500000,,-2.0294922,0.0000000,NO,,0.1190728
TVAAVAGSPGTPTTPGSARK,ph,S,54,true,"atm callus - FC atm vs. atm Xray",111c,31410901,,21.2500000,,-1.0145060,0.0000000,NO,,0.1190728
TVAAVAGSPGTPTTPGSARK,ph,S,54,true,"atm-3 X-ray callus - FC atm vs. atm Xray",111d,31410901,,21.2500000,,-1.0145060,0.0000000,NO,,0.1190728
TVAAVAGSPGTPTTPGSARK,ph,S,54,true,"Tissue atlas Arabidopsis - ProteomicsDB",114,32188942,"MaxQuant score",278.2700000,0.9994280,,,,0,
TVAAVAGSPGTPTTPGSAR,ph,S,54,true,"Large-scale phosphorylation discovery",44,23111157,XCorr,4.8590000,,,,,,
TVAAVAGSPGTPTTPGSAR,ph,S,54,true,"LAXIC - ABA stress",84a,23660473,XCorr,5.3800000,1.0000000,,,,7.3499997199633E-8,
TVAAVAGSPGTPTTPGSAR,ph,S,54,true,"LAXIC - mannitol vs control",84b,23660473,XCorr,5.1800000,0.9990000,,,,4.5299999328563E-5,
TVAAVAGSPGTPTTPGSAR,ph,S,54,true,"SnRK2 protein kinase substrates",85,23776212,XCorr,5.1674271,1.0000000,,,,3.5664698971871E-10,
TVAAVAGSPGTPTTPGSAR,ph,S,54,true,"atm and atr DNA damage response",88,25561503,"MASCOT Score",96.0000000,0.9990000,,,,,0.4200000
SVFHPGSNIATR,ph,S,69,true,"atm and atr DNA damage response",88,25561503,"MASCOT Score",33.0000000,0.9990000,,,,,0.5500000
SVFHPGSNIATR,ph,S,69,true,"Tissue atlas Arabidopsis - ProteomicsDB",114,32188942,"MaxQuant score",108.5800000,0.9990580,,,,7.2537201049272E-5,
GMGTNLFDKPSHPNSPTVYDWLYSDDTR,ph,S,89,true,"PAMP-triggered phosphorylation",48,24601666,"MASCOT Score",52.4200000,,,,,,
GMGTNLFDKPSHPNSPTVYDWLYSDDTR,ph,S,89,true,"Tissue atlas Arabidopsis - ProteomicsDB",114,32188942,"MaxQuant score",317.3200000,0.9988530,,,,0,
