Peptide,PTM,ModifiedAA,ModifiedPosition,PeptideUniqueToGene,ExperimentDesc,ExpID,PubmedID,ScoreType,IdentScore,LocProb,Log2FChange,PQ-val,QuantSig,PEP,MassErrorPPM
ATASALSSLSSLSLHTR,nt,A,2,true,"Tic56 chloroplast import - ppi2",89b,25588737,XCorr,3.7685988,,,,,,
ATASALSSLSSLSLHTR,nta,A,2,true,"Tic56 chloroplast import - ppi2",89b,25588737,XCorr,3.7685988,,,,,,
KASSTDTE,nt,K,49,true,"Arg/N-end rule seed, prt6 vs. Wt",99,29168982,"MASCOT Score",52.6000000,,,,,0.0041990000754595,0.5658264
KASSTDTE,nta,K,49,true,"Arg/N-end rule seed, prt6 vs. Wt",99,29168982,"MASCOT Score",52.6000000,,-0.1462267,0.3177489,NO,0.0041990000754595,0.5658264
ASSTDTE,nt,A,50,true,"Arg/N-end rule seed, prt6 vs. Wt",99,29168982,"MASCOT Score",48.0900000,,-0.7025401,0.1295306,NO,0.050909999758005,-0.1707684
SSTDTETIFFEDETPEITAN,nt,S,51,true,"HUNTER N-terminome: legumain, GluC and trypsin",119,31951383,"MaxQuant score",144.5100000,,,,,,
VVFDPPIAPE,nt,V,71,true,"Arg/N-end rule seed, prt6 vs. Wt",99,29168982,"MASCOT Score",44.0200000,,0.6245195,0.2732379,NO,0.0017490000464022,1.7284389
DIYVMDSK,mox,M,124,true,"cat2 Methionine oxidation - 1h stress",62a,25693801,"MASCOT Score",44.0000000,,0.0908472,,NO,,
DIYVMDSK,mox,M,124,true,"cat2 Methionine oxidation - 3h stress",62b,25693801,"MASCOT Score",44.0000000,,-0.2797050,,NO,,
DIYVMDSKHK,ac,K,127,true,"Quantitative Acetylproteomics",101,29440448,,,,,,,,
QGNVGVGCAK,sno,C,186,true,"hot5-4 / wildtype, FAT-switch S-nitrosoproteome",169,37277371,,,,0.4834894,0.0277680,NO,,
AIVVVGDKQGNVGVGCAK,so,C,186,true,"S-sulfenylation site detection using YAP1C",110,32714340,,,,,,,,
EVVAAVQKSAIDAR,ac,K,198,true,"Quantitative Acetylproteomics",101,29440448,,,,,,,,
SEGDYGAAKVMLRPASPGTGVIAGGAVR,nt,S,222,true,"Arabidopsis translation initiation landscape - NT",167b,35069635,,,,,,,,
VMLRPASPGTGVIAGGAVR,ph,S,237,true,"Tissue atlas Arabidopsis - ProteomicsDB",114,32188942,"MaxQuant score",119.2800000,0.9965640,,,,9.710839716983E-15,
