Peptide,PTM,ModifiedAA,ModifiedPosition,PeptideUniqueToGene,ExperimentDesc,ExpID,PubmedID,ScoreType,IdentScore,LocProb,Log2FChange,PQ-val,QuantSig,PEP,MassErrorPPM
ESDKIVIEDSDDEKEEGELEEGEIDLVDNASDDNLVEK,ph,S,135,true,"Tissue atlas Arabidopsis - ProteomicsDB",114,32188942,"MaxQuant score",192.3900000,0.9996470,,,,0,
IVIEDSDDEKEEGELEEGEIDLVDNASDDNLVEK,ph,S,135,true,"SnRK2 protein kinase substrates",85,23776212,XCorr,3.3632927,1.0000000,,,,1.7310299881501E-5,
IVIEDSDDEK,ph,S,135,true,"srk2dei ABA signaling phopshoproteomics",83,23572148,"MASCOT Score",42.0000000,,,,,,0.0000000
IVIEDSDDEK,ph,S,135,true,"TOR Kinase and ABA Receptor",100,29290610,XCorr,3.1809607,1.0000000,,,,0.0098230000585318,
DHDADSLPSPTRETTPSLPVNGR,ph,S,369,true,"TOR Kinase and ABA Receptor",100,29290610,XCorr,4.0106330,0.8513000,,,,0.00044289999641478,
DHDADSLPSPTR,ph,S,369,true,"STN8 phosphoproteome",38,21768351,"MASCOT Score",58.3900000,,,,,,-0.8755450
DHDADSLPSPTR,ph,S,369,true,"atm and atr DNA damage response",88,25561503,"MASCOT Score",47.0000000,1.0000000,,,,,0.3000000
DHDADSLPSPTR,ph,S,369,true,"Lateral root-induction - NAA vs control",106,23328941,"MASCOT Score",39.0000000,,,,,,
DHDADSLPSPTR,ph,S,369,true,"Col-0 callus - FC Col-0 vs. Col-0 Xray",111a,31410901,,44.9100000,,0.1007561,0.0000000,NO,,0.5807225
DHDADSLPSPTR,ph,S,369,true,"Col-0 X-ray callus - FC Col-0 vs. Col-0 Xray",111b,31410901,,44.9100000,,0.1007561,0.0000000,NO,,0.5807225
DHDADSLPSPTR,ph,S,369,true,"atm callus - FC atm vs. atm Xray",111c,31410901,,44.9100000,,0.3911704,0.0000000,NO,,0.5807225
DHDADSLPSPTR,ph,S,369,true,"atm-3 X-ray callus - FC atm vs. atm Xray",111d,31410901,,44.9100000,,0.3911704,0.0000000,NO,,0.5807225
DHDADSLPSPTR,ph,S,369,true,"Tissue atlas Arabidopsis - ProteomicsDB",114,32188942,"MaxQuant score",274.3900000,0.9994240,,,,0,
ETTPSLPVNGR,ph,T,375,true,"Tissue atlas Arabidopsis - ProteomicsDB",114,32188942,"MaxQuant score",132.8500000,0.9963600,,,,9.5688800118066E-29,
TDDLPSPTPSGEPNDGNGDVGGEVSSSVVK,ph,S,436,true,"TOR Kinase and ABA Receptor",100,29290610,XCorr,4.7130389,0.9707000,,,,8.3300001278985E-6,
TASTDTASLQSLLK,ph,S,641,true,"Tissue atlas Arabidopsis - ProteomicsDB",114,32188942,"MaxQuant score",118.1300000,0.8972940,,,,4.1148301534122E-5,
SLQSLLK,ph,S,649,false,"TOR Kinase and ABA Receptor",100,29290610,XCorr,2.6807184,1.0000000,,,,0.0031630001030862,
SLQSLLK,ph,S,649,false,"Tissue atlas Arabidopsis - ProteomicsDB",114,32188942,"MaxQuant score",123.7500000,1.0000000,,,,0.0029663799796253,
