Peptide,PTM,ModifiedAA,ModifiedPosition,PeptideUniqueToGene,ExperimentDesc,ExpID,PubmedID,ScoreType,IdentScore,LocProb,Log2FChange,PQ-val,QuantSig,PEP,MassErrorPPM
MEGTVFTPCLEGMKHVKS,nta,M,1,true,"Arabidopsis translation initiation landscape - NTA",167a,35069635,,,,,,,,
MEGTVFTPCLEGMKH,nta,M,1,true,"Arg/N-end rule seed, prt6 vs. Wt",99,29168982,"MASCOT Score",51.0400000,,-0.1910957,0.4784400,NO,0.0023519999813288,3.1486912
MEGTVFTPCLEGMK,so,C,9,true,"S-sulfenylation site detection using YAP1C",110,32714340,,,,,,,,
SDQGEMLTKPFLELCK,sno,C,32,true,"hot5-4 / wildtype, FAT-switch S-nitrosoproteome",169,37277371,,,,-0.0575297,0.7848583,NO,,
SDQGEMLTKPFLELCK,so,C,32,true,"Arabidopsis S-sulfenylation chemoproteomics",108,31578252,"pFind PSM Score",0.0733312,,1.0829000,,,,-1.2724624
LEKNYLSDPDKFK,ac,K,62,true,"Quantitative Acetylproteomics",101,29440448,,,,,,,,
LEKNYLSDPDKFK,ub,K,62,true,"upl3 mutant / wildtype",168,35926874,"MaxQuant score",72.6810000,1.0000000,,,,4.3855601688847E-5,2.2887000
NLVAHQDWSMPQACADSYQK,sno,C,126,true,"hot5-4 / wildtype, FAT-switch S-nitrosoproteome",169,37277371,,,,0.3204091,0.0164006,NO,,
NLVAHQDWSMPQACADSYQK,so,C,126,true,"Arabidopsis S-sulfenylation chemoproteomics",108,31578252,"pFind PSM Score",0.0005206,,1.4815600,,,,-0.6660157
FCAEFGPFLHDNHK,so,C,177,true,"Arabidopsis S-sulfenylation chemoproteomics",108,31578252,"pFind PSM Score",0.0398560,,,,,,-1.1750670
