Peptide,PTM,ModifiedAA,ModifiedPosition,PeptideUniqueToGene,ExperimentDesc,ExpID,PubmedID,ScoreType,IdentScore,LocProb,Log2FChange,PQ-val,QuantSig,PEP,MassErrorPPM
AGEAEALATTAPLAPVTSQR,nt,A,2,true,"N-terminal ChaFRADIC",92,26010716,"MASCOT Score",93.9500000,,,,,2.7420000492384E-8,
AGEAEALATTAPLAPVTSQR,nt,A,2,true,"Arg/N-end rule seed, prt6 vs. Wt",99,29168982,"MASCOT Score",76.8200000,,0.8234355,0.2228893,NO,4.3200001528021E-5,0.6974027
AGEAEALATT,nt,A,2,true,"N-term acetylation drought responses",5,26184543,,,,,,,,
AGEAEALATTAPLAPVTSQRKVRN,nta,A,2,true,"HUNTER N-terminome: legumain, GluC and trypsin",119,31951383,"MaxQuant score",69.9470000,,,,,,
AGEAEALATTAPLAPVTSQR,nta,A,2,true,"Characterization plant N-terminal acetylation",6,22223895,"MASCOT Score",75.6400000,,,,,,
AGEAEALATTAPLAPVTSQR,nta,A,2,true,"N-terminal ChaFRADIC",92,26010716,"MASCOT Score",93.9500000,,,,,2.7420000492384E-8,
AGEAEALATTAPLAPVTSQR,nta,A,2,true,"Arg/N-end rule seed, prt6 vs. Wt",99,29168982,"MASCOT Score",76.8200000,,,,,4.3200001528021E-5,0.6974027
AGEAEALATTAPLAPVTSQR,nta,A,2,true,"HUNTER N-terminome: legumain, GluC and trypsin",119,31951383,"MaxQuant score",177.2100000,,,,,,
AGEAEALATT,nta,A,2,true,"N-term acetylation drought responses",5,26184543,,,,,,,,
EAEALATTAPLAPVTSQR,nt,E,4,true,"N-terminal ChaFRADIC",92,26010716,"MASCOT Score",53.2300000,,,,,1.1699999857839E-9,
AGEAEALATTAPLAPVTSQRK,ph,S,19,true,"Tissue atlas Arabidopsis - ProteomicsDB",114,32188942,"MaxQuant score",204.4700000,0.9928360,,,,0,
AKHGSDSSTYDTEGR,ac,K,132,true,"Quantitative Acetylproteomics",101,29440448,,,,,,,,
GCFDGSLFEQIAKER,ub,K,227,true,"upl3 mutant / wildtype",168,35926874,"MaxQuant score",171.7600000,1.0000000,1.7441611,0.1172200,NO,6.748370062271E-22,0.0218740
