Peptide,PTM,ModifiedAA,ModifiedPosition,PeptideUniqueToGene,ExperimentDesc,ExpID,PubmedID,ScoreType,IdentScore,LocProb,Log2FChange,PQ-val,QuantSig,PEP,MassErrorPPM
MNCAISGEVPVEPVVSTKSGLLFER,nta,M,1,true,"HUNTER N-terminome: legumain, GluC and trypsin",119,31951383,"MaxQuant score",40.4040000,,,,,,
MNCAISGEVPVEPVVSTKSGLLFER,nta,M,1,true,"Arabidopsis translation initiation landscape - NTA",167a,35069635,,,,,,,,
MNCAISGEVP,nta,M,1,false,"N-term acetylation drought responses",5,26184543,,,,,,,,
MNCAISGEVPVEPVVSTK,so,C,3,true,"S-sulfenylation site detection using YAP1C",110,32714340,,,,,,,,
MNCAISGEVPVEPVVSTK,ph,S,6,true,"Lateral root-induction - NAA vs control",106,23328941,"MASCOT Score",37.0000000,,,,,,
CPVTGEPLTIDDIVPIK,sno,C,38,true,"hot5-4 / wildtype, FAT-switch S-nitrosoproteome",169,37277371,,,,,,,,
TGEIIKPK,ub,K,60,true,"upl3 mutant / wildtype",168,35926874,"MaxQuant score",66.2700000,1.0000000,1.3740657,0.1779410,NO,0.044277600944042,0.5841900
QELSHALYQHDSACR,nt,Q,99,true,"HUNTER N-terminome: legumain, GluC and trypsin",119,31951383,"MaxQuant score",68.4810000,,,,,,
SACRVIARLKKE,nt,S,110,true,"Arabidopsis translation initiation landscape - NT",167b,35069635,,,,,,,,
QELSHALYQHDSACR,ox,C,112,true,"SPEAR - 10 mM H2O2 / mock",138a,34619326,,,,-0.5041494,0.0463972,YES,,
QELSHALYQHDSACR,so,C,112,true,"Arabidopsis S-sulfenylation chemoproteomics",108,31578252,"pFind PSM Score",0.1923810,,,,,,-0.9260402
QIPQTLASIDTLER,nt,Q,195,true,"HUNTER N-terminome: legumain, GluC and trypsin",119,31951383,"MaxQuant score",68.0690000,,,,,,
TNKPGICSMDILHSK,so,C,226,true,"S-sulfenylation site detection using YAP1C",110,32714340,,,,,,,,
NPGDGNYACGYTLNDHSAEVR,so,C,301,true,"Arabidopsis S-sulfenylation chemoproteomics",108,31578252,"pFind PSM Score",0.0000441,,1.3888900,,,,-1.0520047
GYTLNDHSAE,nt,G,302,true,"Arg/N-end rule seed, prt6 vs. Wt",99,29168982,"MASCOT Score",33.1000000,,-0.2961931,0.0168594,NO,0.010119999758899,-2.8244997
ANVDDDSAQDS,ph,S,521,true,"atm and atr DNA damage response",88,25561503,"MASCOT Score",42.0000000,1.0000000,,,,,-1.0000000
ANVDDDSAQDS,ph,S,525,true,"atm and atr DNA damage response",88,25561503,"MASCOT Score",47.0000000,0.9960000,,,,,-1.5400000
