Peptide,PTM,ModifiedAA,ModifiedPosition,PeptideUniqueToGene,ExperimentDesc,ExpID,PubmedID,ScoreType,IdentScore,LocProb,Log2FChange,PQ-val,QuantSig,PEP,MassErrorPPM
YAAKDIRFGVE,nt,Y,32,true,"Arabidopsis translation initiation landscape - NT",167b,35069635,,,,,,,,
AAKDIRFGVEARAL,nt,A,33,true,"Arabidopsis translation initiation landscape - NT",167b,35069635,,,,,,,,
GVEDLADAVKVTMGPKGR,nt,G,50,false,"Metacaspase9 substrates - Col-0 / mc9",51a,23964026,"MASCOT Score",64.0000000,,,,,,-1.3941432
GVEDLADAVKVTMGPKGR,nt,G,50,false,"Arabidopsis translation initiation landscape - NT",167b,35069635,,,,,,,,
VTMGPK,mox,M,62,false,"cat2 Methionine oxidation - 3h stress",62b,25693801,"MASCOT Score",35.0000000,,-0.1990535,,NO,,
GAPKVTKDGVTVAKSIEFKDR,nt,G,76,true,"Mitochondrial intermediate peptidases - icp55 / WT",131a,25732537,,48.1600000,,-0.1065317,,,,
GAPKVTKDGVTVAKSIEFKDR,nt,G,76,true,"Mitochondrial intermediate peptidases - oct1-2 / WT",131c,25732537,,50.3900000,,-0.0817023,,,,
IKNVGASLVK,ac,K,98,false,"Quantitative Acetylproteomics",101,29440448,,,,,,,,
QVANATNDVAGDGTTCATVLTR,ox,C,122,false,"Redox kickstart of mitochondria",112,31871212,,,,-1.9255283,0.0016020,YES,,
QVANATNDVAGDGTTCATVLTR,sno,C,122,false,"hot5-4 / wildtype, FAT-switch S-nitrosoproteome",169,37277371,,,,,,,,
QVANATNDVAGDGTTCATVLTR,so,C,122,false,"S-sulfenylation site detection using YAP1C",110,32714340,,,,,,,,
AIFTEGCK,ox,C,135,true,"OxiTRAQ Arabidopsis - 5 mM H2O2 versus control",47,24376095,,,,0.1521547,0.0521121,NO,,
AIFTEGCK,ox,C,135,true,"Redox kickstart of mitochondria",112,31871212,,,,-1.5483657,0.0063695,YES,,
AIFTEGCK,sno,C,135,true,"hot5-4 / wildtype, FAT-switch S-nitrosoproteome",169,37277371,,,,-0.5062440,0.2010009,NO,,
AIFTEGCK,so,C,135,true,"Arabidopsis S-sulfenylation chemoproteomics",108,31578252,"pFind PSM Score",0.1964800,,0.8849600,,,,-0.8013659
AIFTEGCK,so,C,135,true,"S-sulfenylation site detection using YAP1C",110,32714340,,,,,,,,
SVAAGMNAMDLR,nt,S,137,false,"Arabidopsis translation initiation landscape - NT",167b,35069635,,,,,,,,
CELEDPLILIHEK,ox,C,244,true,"SPEAR - 50 mM H2O2 / mock",138b,34619326,,,,2.6559759,0.0218893,YES,,
CELEDPLILIHEK,sno,C,244,true,"hot5-4 / wildtype, FAT-switch S-nitrosoproteome",169,37277371,,,,,,,,
CELEDPLILIHEK,so,C,244,true,"S-sulfenylation site detection using YAP1C",110,32714340,,,,,,,,
AVKAPGFGE,nt,A,306,false,"Arg/N-end rule seed, prt6 vs. Wt",99,29168982,"MASCOT Score",27.4400000,,,,,0.0043049999512732,0.7185434
AVKAPGFGE,nta,A,306,false,"Arg/N-end rule seed, prt6 vs. Wt",99,29168982,"MASCOT Score",27.4400000,,,,,0.0043049999512732,0.7185434
QAIGERCEQIR,so,C,377,true,"Arabidopsis S-sulfenylation chemoproteomics",108,31578252,"pFind PSM Score",0.3085030,,1.0869600,,,,0.6723654
SMVEASTSDYDKEKLQER,ub,K,395,true,"Arabidopsis ubiquitination COFRADIC",40,26744219,"MaxQuant Score",106.7500000,0.8660000,,,,9.0510003292187E-24,-0.0160000
IGGASETEVSEKK,ac,K,423,true,"Quantitative Acetylproteomics",101,29440448,,,,,,,,
IASNAGVE,nt,I,485,false,"Arg/N-end rule seed, prt6 vs. Wt",99,29168982,"MASCOT Score",47.6100000,,-0.3157407,0.0910966,NO,0.020740000531077,0.2083714
QDNPDLGYDAAKGE,nt,Q,503,false,"HUNTER N-terminome: legumain, GluC and trypsin",119,31951383,"MaxQuant score",59.5700000,,,,,,
QDNPDLGYD,nt,Q,503,false,"Arg/N-end rule seed, prt6 vs. Wt",99,29168982,"MASCOT Score",56.6200000,,0.5626281,0.3939763,NO,0.0062870001420379,-1.5423956
SVSSLLTTTE,nt,S,541,false,"Arg/N-end rule seed, prt6 vs. Wt",99,29168982,"MASCOT Score",34.4100000,,-1.0856290,0.0342000,YES,0.045269999653101,-3.8872086
