Peptide,PTM,ModifiedAA,ModifiedPosition,PeptideUniqueToGene,ExperimentDesc,ExpID,PubmedID,ScoreType,IdentScore,LocProb,Log2FChange,PQ-val,QuantSig,PEP,MassErrorPPM
LAGDSAAYQRTSLYGDD,nt,L,35,true,"HUNTER N-terminome: legumain, GluC and trypsin",119,31951383,"MaxQuant score",99.5310000,,,,,,
LAGDSAAYQRTSLYGD,nt,L,35,true,"HUNTER N-terminome: legumain, GluC and trypsin",119,31951383,"MaxQuant score",165.7300000,,,,,,
LAGDSAAYQR,nt,L,35,true,"Arg/N-end rule pathway Roots",80,25728785,"MASCOT Score",54.9100000,,,,,0.0034570000134408,
LAGDSAAYQR,nt,L,35,true,"N-terminal ChaFRADIC",92,26010716,"MASCOT Score",65.4900000,,,,,4.9359999820808E-7,
LAGDSAAYQR,nt,L,35,true,"Arg/N-end rule seed, prt6 vs. Wt",99,29168982,"MASCOT Score",66.4700000,,0.2378037,0.0291596,NO,0.019549999386072,-0.6771214
LAGDSAAYQR,nt,L,35,true,"FtsH12 N-terminome: WT / FtsH12 knockdown miRNA",118,33216923,"MaxQuant score",51.7980000,,,,,0.0047821002081037,
LAGDSAAYQR,nt,L,35,true,"Arabidopsis translation initiation landscape - NT",167b,35069635,,,,,,,,
SLYGDDVVIVAAHR,nta,S,46,true,"FtsH12 N-terminome: WT / FtsH12 knockdown miRNA",118,33216923,"MaxQuant score",119.2700000,,,,,1.8200000340585E-5,
TPLCKSKR,nt,T,60,true,"Metacaspase9 substrates - Col-0 / mc9",51a,23964026,"MASCOT Score",45.0000000,,1.5416767,,NO,,-0.3303833
GNFKDTYPDDLLAPVLR,ub,K,71,true,"Arabidopsis ubiquitination COFRADIC",40,26744219,"MaxQuant Score",93.2260000,1.0000000,,,,1.5049999350498E-16,0.7430000
AFYAGFPE,nt,A,120,false,"Arg/N-end rule seed, prt6 vs. Wt",99,29168982,"MASCOT Score",33.1700000,,0.2583924,0.7498629,NO,0.027589999139309,-1.1383545
AGFPETVAVR,nt,A,123,true,"Arg/N-end rule seed, prt6 vs. Wt",99,29168982,"MASCOT Score",50.7400000,,0.0216082,0.9592897,NO,0.018540000542998,-0.5063588
TVNRQCSSGLQAVADVAAAIK,acy,C,138,false,"Arabidopsis S-acylation atlas - Leaf",163c,35681017,,,,,,,,
TVNRQCSSGLQAVADVAAAIK,acy,C,138,false,"Arabidopsis S-acylation atlas - Seedling",163d,35681017,,,,,,,,
QCSSGLQAVADVAAAIK,acy,C,138,false,"Arabidopsis S-acylation atlas - Meristem",163a,35681017,,,,,,,,
QCSSGLQAVADVAAAIK,acy,C,138,false,"Arabidopsis S-acylation atlas - Hypocotyl",163b,35681017,,,,,,,,
QCSSGLQAVADVAAAIK,acy,C,138,false,"Arabidopsis S-acylation atlas - Leaf",163c,35681017,,,,,,,,
QCSSGLQAVADVAAAIK,acy,C,138,false,"Arabidopsis S-acylation atlas - Silique",163e,35681017,,,,,,,,
QCSSGLQAVADVAAAIK,acy,C,138,false,"Arabidopsis S-acylation atlas - Stem",163f,35681017,,,,,,,,
QCSSGLQAVADVAAAIK,ox,C,138,false,"Redox kickstart of mitochondria",112,31871212,,,,-0.3562913,0.0144478,YES,,
QCSSGLQAVADVAAAIK,sno,C,138,false,"Endogenous S-nitrosylation in Arabidopsis",64,22115780,"MASCOT Score",70.0000000,,,,,,
QCSSGLQAVADVAAAIK,sno,C,138,false,"Site-specific nitrosomeproteomic id - gsnor1-3",90b,25699590,XCorr,2.7200000,,,,,0.022369999438524,-6.3000000
QCSSGLQAVADVAAAIK,sno,C,138,false,"hot5-4 / wildtype, FAT-switch S-nitrosoproteome",169,37277371,,,,,,,,
SMTTNPMAWE,nt,S,167,true,"N-terminal ChaFRADIC",92,26010716,"MASCOT Score",44.7800000,,,,,7.0510002842639E-5,
CLLPMGVTSENVAQR,nt,C,192,true,"Arg/N-end rule seed, prt6 vs. Wt",99,29168982,"MASCOT Score",32.8200000,,0.6517089,0.2540864,NO,0.037099998444319,-1.5524734
CLLPMGVTSE,nt,C,192,true,"Arg/N-end rule seed, prt6 vs. Wt",99,29168982,"MASCOT Score",37.5300000,,0.0222745,0.9492976,NO,0.00091349997092038,1.3310582
LLPMGVTSENVAQR,nt,L,193,true,"Arg/N-end rule seed, prt6 vs. Wt",99,29168982,"MASCOT Score",43.3400000,,-0.7093843,0.0291479,NO,0.012000000104308,-0.7838037
LLPMGVTSE,nt,L,193,true,"Arg/N-end rule seed, prt6 vs. Wt",99,29168982,"MASCOT Score",38.7300000,,0.5638932,0.1037212,NO,0.010219999589026,1.0590303
LPMGVTSENVAQR,nt,L,194,true,"Arg/N-end rule seed, prt6 vs. Wt",99,29168982,"MASCOT Score",33.0400000,,-0.6121130,0.3317316,NO,0.010639999993145,-0.0814678
LPMGVTSE,nt,L,194,true,"Arg/N-end rule seed, prt6 vs. Wt",99,29168982,"MASCOT Score",57.3100000,,0.0663287,0.5751711,NO,0.0071530002169311,0.2738071
GVTSENVAQR,nt,G,197,true,"Tic56 chloroplast import - tic56-1",89c,25588737,XCorr,3.7667925,,,,,,
GVTSENVAQR,nt,G,197,true,"Arg/N-end rule seed, prt6 vs. Wt",99,29168982,"MASCOT Score",55.8200000,,-0.1014819,0.8803176,NO,0.0063280002214015,-1.4553402
GVTSENVAQR,nt,G,197,true,"FtsH12 N-terminome: WT / FtsH12 knockdown miRNA",118,33216923,"MaxQuant score",92.3190000,,,,,0.0003870099899359,
TSENVAQR,nt,T,199,true,"Arg/N-end rule seed, prt6 vs. Wt",99,29168982,"MASCOT Score",34.7600000,,0.1305701,0.6904299,NO,0.091430000960827,-0.3227364
QEQDQAAVDSH,nt,Q,212,true,"Metacaspase9 substrates - in vitro rMC9",51c,23964026,"MASCOT Score",64.0000000,,1.5853465,,NO,,0.0000000
KAAAATAAGKFK,ac,K,233,true,"Quantitative Acetylproteomics",101,29440448,,,,,,,,
AAAATAAGKFK,ac,K,233,true,"Quantitative Acetylproteomics",101,29440448,,,,,,,,
TGDEKPITVSVDDGIRPTTTLASLGK,ph,S,272,true,"Tissue atlas Arabidopsis - ProteomicsDB",114,32188942,"MaxQuant score",162.3800000,0.9709270,,,,0,
DGTTTAGNSSQVSDGAGAVLLMKR,nt,D,283,true,"Metacaspase9 substrates - in vitro rMC9",51c,23964026,"MASCOT Score",44.0000000,,3.8252064,,NO,,0.0000000
RSVAMQK,mox,M,310,true,"cat2 Methionine oxidation - 3h stress",62b,25693801,"MASCOT Score",35.0000000,,-0.1293375,,NO,,
SVAMQKGLPVLGVFR,hib,K,312,true,"Open search Plant PTM Viewer 2.0 - hib",164e,TBA,,,,,,,,
EAFASQFVYCR,nt,E,362,false,"FtsH12 N-terminome: WT / FtsH12 knockdown miRNA",118,33216923,"MaxQuant score",74.9620000,,,,,0.0046783001162112,
IGTGMGAAAVFER,nt,I,426,false,"Arg/N-end rule seed, prt6 vs. Wt",99,29168982,"MASCOT Score",62.4700000,,0.2824940,0.4105872,NO,0.0083250002935529,0.2372760
GTGMGAAAVFE,nt,G,427,false,"Arg/N-end rule seed, prt6 vs. Wt",99,29168982,"MASCOT Score",44.3400000,,-0.9613303,0.1273872,NO,0.0005708999815397,-1.6624033
GMGAAAVFE,nt,G,429,false,"Arg/N-end rule seed, prt6 vs. Wt",99,29168982,"MASCOT Score",47.5300000,,-0.1536819,0.7176864,NO,0.037140000611544,-0.1804784
KVEAQGLLSKDAR,ph,S,458,true,"Tissue atlas Arabidopsis - ProteomicsDB",114,32188942,"MaxQuant score",99.7050000,1.0000000,,,,7.4534698796924E-5,
KVEAQGLLSKDAR,ub,K,459,true,"Arabidopsis ubiquitination COFRADIC",40,26744219,"MaxQuant Score",121.1800000,1.0000000,,,,3.5060000235177E-15,-0.0470000
