Peptide,PTM,ModifiedAA,ModifiedPosition,PeptideUniqueToGene,ExperimentDesc,ExpID,PubmedID,ScoreType,IdentScore,LocProb,Log2FChange,PQ-val,QuantSig,PEP,MassErrorPPM
VGNSAVSLPTTPGGNEMTHR,ph,S,220,true,"atm and atr DNA damage response",88,25561503,"MASCOT Score",32.0000000,0.9870000,,,,,-1.0900000
VGNSAVSLPTTPGGNEMTHR,ph,S,220,true,"TOR Kinase and ABA Receptor",100,29290610,XCorr,3.5802381,0.9900000,,,,0.00025899999309331,
VGNSAVSLPTTPGGNEMTHR,ph,S,220,true,"Tissue atlas Arabidopsis - ProteomicsDB",114,32188942,"MaxQuant score",163.4600000,0.9999870,,,,7.6840399332461E-30,
VGNSAVSLPTTPGGNEMTHR,ph,T,223,true,"Large-scale phosphorylation discovery",44,23111157,XCorr,3.9680000,,,,,,
VGNSAVSLPTTPGGNEMTHR,ph,T,223,true,"TOR Kinase and ABA Receptor",100,29290610,XCorr,3.5802381,0.8385000,,,,0.00025899999309331,
VGNSAVSLPTTPGGNEMTHR,ph,T,224,true,"Large-scale phosphorylation discovery",44,23111157,XCorr,3.6540000,,,,,,
VGNSAVSLPTTPGGNEMTHR,ph,T,224,true,"atm and atr DNA damage response",88,25561503,"MASCOT Score",32.0000000,0.9060000,,,,,-1.0900000
VGNSAVSLPTTPGGNEMTHR,ph,T,224,true,"Tissue atlas Arabidopsis - ProteomicsDB",114,32188942,"MaxQuant score",171.8300000,0.9871150,,,,7.2955300529921E-35,
DSDCVTPPQGR,ph,T,239,true,"Pollen phosphoproteome Arabidopsis",43,22631563,"MASCOT Score",67.5600000,,,,,,
DSDCVTPPQGR,ph,T,239,true,"Tissue atlas Arabidopsis - ProteomicsDB",114,32188942,"MaxQuant score",182.2300000,1.0000000,,,,1.1011800331176E-13,
IESSFDDLAVHK,ph,S,248,true,"Tissue atlas Arabidopsis - ProteomicsDB",114,32188942,"MaxQuant score",110.3800000,0.9956610,,,,6.5381696913391E-5,
RLSWPPSVK,ph,S,286,true,"atm and atr DNA damage response",88,25561503,"MASCOT Score",31.0000000,1.0000000,,,,,-2.4500000
RLSWPPSVK,ph,S,286,true,"Phospho cell culture sucrose/TOR",109,30833711,,,0.9998350,,,,,
RLSWPPSVK,ph,S,286,true,"Tissue atlas Arabidopsis - ProteomicsDB",114,32188942,"MaxQuant score",163.9300000,1.0000000,,,,8.3653001638595E-5,
