Peptide,PTM,ModifiedAA,ModifiedPosition,PeptideUniqueToGene,ExperimentDesc,ExpID,PubmedID,ScoreType,IdentScore,LocProb,Log2FChange,PQ-val,QuantSig,PEP,MassErrorPPM
ALIIAGKR,ac,K,50,true,"Quantitative Acetylproteomics",101,29440448,,,,,,,,
LCEPALVAADAPQYR,ox,C,353,true,"SPEAR - 10 mM H2O2 / mock",138a,34619326,,,,4.8687995,0.0016151,YES,,
VVRQDNVSYISK,ng,N,463,true,"Conserved N-glycosylation",74,22633491,"MaxQuant Score",118.6300000,1.0000000,,,,3.0599998979142E-8,0.6190000
YISKSWMALKEPIGIWGEN,nt,Y,466,true,"HUNTER N-terminome: legumain, GluC and trypsin",119,31951383,"MaxQuant score",58.1580000,,,,,,
NGPNSTVSIDSMRDVLR,ng,N,527,true,"Conserved N-glycosylation",74,22633491,"MaxQuant Score",109.4600000,0.9970000,,,,2.8009999368805E-6,0.1110000
LTGFKNGDLDLSK,ac,K,604,true,"Quantitative Acetylproteomics",101,29440448,,,,,,,,
SVAPEVHLHCEDGHVISSIEFASYGTPR,nt,S,792,true,"HUNTER N-terminome: legumain, GluC and trypsin",119,31951383,"MaxQuant score",119.3300000,,,,,,
SVAPEVHLHCED,nt,S,792,true,"HUNTER N-terminome: legumain, GluC and trypsin",119,31951383,"MaxQuant score",98.1560000,,,,,,
GSCDGFSIGK,ox,C,822,true,"OxiTRAQ Arabidopsis - 5 mM H2O2 versus control",47,24376095,,,,-0.0610058,0.6099878,NO,,
GSCDGFSIGK,sno,C,822,true,"hot5-4 / wildtype, FAT-switch S-nitrosoproteome",169,37277371,,,,-1.6656300,0.0000004,YES,,
