Peptide,PTM,ModifiedAA,ModifiedPosition,PeptideUniqueToGene,ExperimentDesc,ExpID,PubmedID,ScoreType,IdentScore,LocProb,Log2FChange,PQ-val,QuantSig,PEP,MassErrorPPM
ATPMVSSAGGLLAMLNEPHPVLK,nta,A,2,true,"Characterization plant N-terminal acetylation",6,22223895,"MASCOT Score",45.2200000,,,,,,
SKAVESNEMVDIDPR,nt,S,119,true,"Arabidopsis translation initiation landscape - NT",167b,35069635,,,,,,,,
AVESNEMVDIDPR,ph,S,124,true,"Tissue atlas Arabidopsis - ProteomicsDB",114,32188942,"MaxQuant score",103.1400000,1.0000000,,,,0.0001911589934025,
DRLPAPKTR,ac,K,279,false,"Quantitative Acetylproteomics",101,29440448,,,,,,,,
TDPVDATYAE,nt,T,318,true,"N-terminal ChaFRADIC",92,26010716,"MASCOT Score",39.6500000,,,,,0.0026740001048893,
SATAGLGVIHR,nt,S,412,false,"Arg/N-end rule seed, prt6 vs. Wt",99,29168982,"MASCOT Score",62.4700000,,-0.6363687,0.3106967,NO,0.020740000531077,-0.5264791
APYLPQGGAGGGGSPYSE,nt,A,433,false,"Arg/N-end rule seed, prt6 vs. Wt",99,29168982,"MASCOT Score",23.6600000,,-0.1902807,0.6717778,NO,0.045570001006126,-0.2088652
SESYNPHVRY,nt,S,651,false,"Arabidopsis translation initiation landscape - NT",167b,35069635,,,,,,,,
IILDKHEDTMSK,ac,K,730,false,"Histone deacetylases - apicidin vs control",98a,29061669,"MaxQuant Score",77.7000000,1.0000000,0.2610000,0.3475362,NO,0.0010000000474975,
IILDKHEDTMSK,ac,K,730,false,"Quantitative Acetylproteomics",101,29440448,,,,,,,,
LPTAVLSTSVK,ph,S,844,true,"Tissue atlas Arabidopsis - ProteomicsDB",114,32188942,"MaxQuant score",152.3800000,0.8390220,,,,7.9806996566845E-9,
LPTAVLSTSVKAK,ub,K,848,true,"upl3 mutant / wildtype",168,35926874,"MaxQuant score",56.4140000,1.0000000,0.0565835,0.9419200,NO,0.0012062999885529,-0.1347900
TSGPEKPVNESGSGKGK,ph,S,876,true,"Tissue atlas Arabidopsis - ProteomicsDB",114,32188942,"MaxQuant score",177.4400000,0.9999990,,,,6.4635800007075E-19,
TSGPEKPVNESGSGK,ph,S,876,true,"SnRK2 protein kinase substrates",85,23776212,XCorr,2.8813901,1.0000000,,,,0.012821099720895,
TSGPEKPVNESGSGKGK,ph,S,878,true,"SnRK2 protein kinase substrates",85,23776212,XCorr,2.3653638,0.8120000,,,,0.0091091198846698,
TSGPEKPVNESGSGKGK,ph,S,878,true,"Tissue atlas Arabidopsis - ProteomicsDB",114,32188942,"MaxQuant score",199.0900000,0.9999990,,,,1.8374400153543E-34,
TSGPEKPVNESGSGK,ph,S,878,true,"LAXIC - mannitol vs control",84b,23660473,XCorr,2.6100000,0.9920000,,,,0.0026302100159228,
TSGPEKPVNESGSGK,ph,S,878,true,"Phospho cell culture sucrose/TOR",109,30833711,,,0.9432740,,,,,
TSGPEKPVNESGSGK,ph,S,878,true,"Col-0 callus - FC Col-0 vs. Col-0 Xray",111a,31410901,,47.0200000,,-2.1397526,0.0000000,NO,,0.7511109
TSGPEKPVNESGSGK,ph,S,878,true,"Col-0 X-ray callus - FC Col-0 vs. Col-0 Xray",111b,31410901,,47.0200000,,-2.1397526,0.0000000,NO,,0.7511109
TSGPEKPVNESGSGK,ph,S,878,true,"atm callus - FC atm vs. atm Xray",111c,31410901,,47.0200000,,-1.0324700,0.0000000,NO,,0.7511109
TSGPEKPVNESGSGK,ph,S,878,true,"atm-3 X-ray callus - FC atm vs. atm Xray",111d,31410901,,47.0200000,,-1.0324700,0.0000000,NO,,0.7511109
TSGPEKPVNESGSGKGK,ub,K,880,true,"Ubiquitination Membrane Proteins",120,33585938,,,,,,,,
GKASTEKEGDSMQVDSPAAVEK,ph,S,884,true,"Tissue atlas Arabidopsis - ProteomicsDB",114,32188942,"MaxQuant score",142.7200000,0.8968380,,,,6.928089666626E-33,
EGDSMQVDSPAAVEK,ph,S,891,true,"Tyrosine phosphorylation in Arabidopsis",59,18463617,"MASCOT Score",25.0000000,,,,,,-0.5482262
EGDSMQVDSPAAVEK,ph,S,891,true,"srk2dei ABA signaling phopshoproteomics",83,23572148,"MASCOT Score",60.0000000,,,,,,-0.0001000
EGDSMQVDSPAAVEK,ph,S,891,true,"Tissue atlas Arabidopsis - ProteomicsDB",114,32188942,"MaxQuant score",130.2700000,1.0000000,,,,6.3665100924482E-7,
ASTEKEGDSMQVDSPAAVEK,ph,S,896,true,"Arabidopsis root NAA phosphoproteome",18a,27643528,"MaxQuant Score",44.1580000,0.9950000,,,,0.00088980002328753,0.0410000
ASTEKEGDSMQVDSPAAVEK,ph,S,896,true,"Phosphoproteome ethylene-regulated time response",46,24043427,"MASCOT Score",51.0700000,,,,,,6.3178000
ASTEKEGDSMQVDSPAAVEK,ph,S,896,true,"Chloroplast kinase substrates",60,19376835,"MASCOT Score",62.0000000,,,,,,-0.5443050
ASTEKEGDSMQVDSPAAVEK,ph,S,896,true,"LAXIC - ABA stress",84a,23660473,XCorr,3.3100000,1.0000000,,,,0.049259401857853,
ASTEKEGDSMQVDSPAAVEK,ph,S,896,true,"SnRK2 protein kinase substrates",85,23776212,XCorr,4.6508422,1.0000000,,,,0.00052276102360338,
ASTEKEGDSMQVDSPAAVEK,ph,S,896,true,"Col-0 callus - FC Col-0 vs. Col-0 Xray",111a,31410901,,47.8200000,,-0.6114497,0.0000000,NO,,0.9257118
ASTEKEGDSMQVDSPAAVEK,ph,S,896,true,"Col-0 X-ray callus - FC Col-0 vs. Col-0 Xray",111b,31410901,,47.8200000,,-0.6114497,0.0000000,NO,,0.9257118
ASTEKEGDSMQVDSPAAVEK,ph,S,896,true,"atm callus - FC atm vs. atm Xray",111c,31410901,,47.8200000,,-0.3772379,0.0000000,NO,,0.9257118
ASTEKEGDSMQVDSPAAVEK,ph,S,896,true,"atm-3 X-ray callus - FC atm vs. atm Xray",111d,31410901,,47.8200000,,-0.3772379,0.0000000,NO,,0.9257118
ASTEKEGDSMQVDSPAAVEK,ph,S,896,true,"Touch-induced phosphorylation: 40s touch vs untouc",136,30291188,"MASCOT score",71.7900000,,-0.2396111,0.6118080,NO,,3.4337053
EGDSMQVDSPAAVEK,ph,S,896,true,"Phosphorylation nuclei-enriched fractions",28,19245862,,,,,,,,
EGDSMQVDSPAAVEK,ph,S,896,true,"Pollen phosphoproteome Arabidopsis",43,22631563,"MASCOT Score",54.8400000,,,,,,-1.7724800
EGDSMQVDSPAAVEK,ph,S,896,true,"Large-scale phosphorylation discovery",44,23111157,XCorr,4.3300000,,,,,,
EGDSMQVDSPAAVEK,ph,S,896,true,"Tyrosine phosphorylation in Arabidopsis",59,18463617,"MASCOT Score",62.0000000,,,,,,-0.9652204
EGDSMQVDSPAAVEK,ph,S,896,true,"Chloroplast kinase substrates",60,19376835,"MASCOT Score",78.2600000,,,,,,-0.9815710
EGDSMQVDSPAAVEK,ph,S,896,true,"srk2dei ABA signaling phopshoproteomics",83,23572148,"MASCOT Score",69.0000000,,,,,,-0.0007000
EGDSMQVDSPAAVEK,ph,S,896,true,"LAXIC - ABA stress",84a,23660473,XCorr,4.8100000,1.0000000,,,,4.9800001988842E-7,
EGDSMQVDSPAAVEK,ph,S,896,true,"LAXIC - mannitol vs control",84b,23660473,XCorr,4.6000000,1.0000000,,,,1.3499999729216E-11,
EGDSMQVDSPAAVEK,ph,S,896,true,"SnRK2 protein kinase substrates",85,23776212,XCorr,4.4299340,1.0000000,,,,0.00030027100001462,
EGDSMQVDSPAAVEK,ph,S,896,true,"atm and atr DNA damage response",88,25561503,"MASCOT Score",89.0000000,1.0000000,,,,,0.9500000
EGDSMQVDSPAAVEK,ph,S,896,true,"TOR Kinase and ABA Receptor",100,29290610,XCorr,4.8248005,1.0000000,,,,1.8829999817171E-6,
EGDSMQVDSPAAVEK,ph,S,896,true,"Lateral root-induction - NAA vs control",106,23328941,"MASCOT Score",50.0000000,,,,,,
EGDSMQVDSPAAVEK,ph,S,896,true,"Phospho cell culture sucrose/TOR",109,30833711,,,1.0000000,,,,,
EGDSMQVDSPAAVEK,ph,S,896,true,"Col-0 callus - FC Col-0 vs. Col-0 Xray",111a,31410901,,70.2200000,,0.4432315,0.0000000,NO,,1.0120748
EGDSMQVDSPAAVEK,ph,S,896,true,"Col-0 X-ray callus - FC Col-0 vs. Col-0 Xray",111b,31410901,,70.2200000,,0.4432315,0.0000000,NO,,1.0120748
EGDSMQVDSPAAVEK,ph,S,896,true,"atm callus - FC atm vs. atm Xray",111c,31410901,,70.2200000,,-0.1490585,0.0000000,NO,,1.0120748
EGDSMQVDSPAAVEK,ph,S,896,true,"atm-3 X-ray callus - FC atm vs. atm Xray",111d,31410901,,70.2200000,,-0.1490585,0.0000000,NO,,1.0120748
EGDSMQVDSPAAVEK,ph,S,896,true,"Tissue atlas Arabidopsis - ProteomicsDB",114,32188942,"MaxQuant score",322.3700000,1.0000000,,,,0,
KAPEPEPAFEILVNPAR,nt,K,903,true,"Metacaspase9 substrates - in vitro rMC9",51c,23964026,"MASCOT Score",60.0000000,,3.1755324,,NO,,-0.9915272
KAPEPEPAFEILVNPAR,ub,K,903,true,"upl3 mutant / wildtype",168,35926874,"MaxQuant score",111.2200000,1.0000000,0.7865964,0.0462020,YES,4.9050998818245E-9,-0.2895300
VVPAQEKYIK,ub,K,926,true,"upl3 mutant / wildtype",168,35926874,"MaxQuant score",55.6490000,1.0000000,-0.3864683,,,0.0036238799802959,-0.1646600
