Peptide,PTM,ModifiedAA,ModifiedPosition,PeptideUniqueToGene,ExperimentDesc,ExpID,PubmedID,ScoreType,IdentScore,LocProb,Log2FChange,PQ-val,QuantSig,PEP,MassErrorPPM
MEANSGGGGGAEGGR,nta,M,1,true,"Characterization plant N-terminal acetylation",6,22223895,"MASCOT Score",71.5800000,,,,,,
MEANSGGGGGAEGGR,nta,M,1,true,"Arg/N-end rule pathway Roots",80,25728785,"MASCOT Score",91.8300000,,,,,4.9010000111593E-6,
MEANSGGGGGAEGGR,nta,M,1,true,"FtsH12 N-terminome: WT / FtsH12 knockdown miRNA",118,33216923,"MaxQuant score",108.7000000,,,,,0.0048063001595438,
MEANSGGGGG,nta,M,1,true,"N-term acetylation drought responses",5,26184543,,,,,,,,
MEANSGGGGGAEGGR,ph,S,5,true,"Tissue atlas Arabidopsis - ProteomicsDB",114,32188942,"MaxQuant score",94.5690000,1.0000000,,,,7.8205803220044E-6,
AVTGGGGGGGGSDVELVSK,ph,T,18,true,"Tissue atlas Arabidopsis - ProteomicsDB",114,32188942,"MaxQuant score",214.4600000,1.0000000,,,,0,
AVTGGGGGGGGSDVELVSK,ph,S,27,true,"STN8 phosphoproteome",38,21768351,"MASCOT Score",63.2100000,,,,,,-1.8432100
AVTGGGGGGGGSDVELVSK,ph,S,27,true,"srk2dei ABA signaling phopshoproteomics",83,23572148,"MASCOT Score",73.0000000,,,,,,-0.0005000
AVTGGGGGGGGSDVELVSK,ph,S,27,true,"SnRK2 protein kinase substrates",85,23776212,XCorr,3.6677477,1.0000000,,,,4.0035399995197E-10,
AVTGGGGGGGGSDVELVSK,ph,S,27,true,"atm and atr DNA damage response",88,25561503,"MASCOT Score",47.0000000,0.9950000,,,,,0.0800000
AVTGGGGGGGGSDVELVSK,ph,S,27,true,"TOR Kinase and ABA Receptor",100,29290610,XCorr,6.6770864,1.0000000,,,,5.6269999770819E-10,
AVTGGGGGGGGSDVELVSK,ph,S,27,true,"Lateral root-induction - NAA vs control",106,23328941,"MASCOT Score",38.0000000,,,,,,
AVTGGGGGGGGSDVELVSK,ph,S,27,true,"Tissue atlas Arabidopsis - ProteomicsDB",114,32188942,"MaxQuant score",251.4400000,1.0000000,,,,0,
TIDSPGQEETGMTGVSK,ph,T,204,true,"srk2dei ABA signaling phopshoproteomics",83,23572148,"MASCOT Score",33.0000000,,,,,,0.0013000
TIDSPGQEETGMTGVSK,ph,T,204,true,"Col-0 callus - FC Col-0 vs. Col-0 Xray",111a,31410901,,30.5900000,,0.6153038,0.0000000,NO,,1.4764389
TIDSPGQEETGMTGVSK,ph,T,204,true,"Col-0 X-ray callus - FC Col-0 vs. Col-0 Xray",111b,31410901,,30.5900000,,0.6153038,0.0000000,NO,,1.4764389
TIDSPGQEETGMTGVSK,ph,T,204,true,"atm callus - FC atm vs. atm Xray",111c,31410901,,30.5900000,,0.9144050,0.0000000,NO,,1.4764389
TIDSPGQEETGMTGVSK,ph,T,204,true,"atm-3 X-ray callus - FC atm vs. atm Xray",111d,31410901,,30.5900000,,0.9144050,0.0000000,NO,,1.4764389
TIDSPGQEETGMTGVSK,ph,S,207,true,"Phosphorylation nuclei-enriched fractions",28,19245862,,,,,,,,
TIDSPGQEETGMTGVSK,ph,S,207,true,"Large-scale phosphorylation discovery",44,23111157,XCorr,3.9180000,,,,,,
TIDSPGQEETGMTGVSK,ph,S,207,true,"Tyrosine phosphorylation in Arabidopsis",59,18463617,"MASCOT Score",61.0000000,,,,,,-0.7159543
TIDSPGQEETGMTGVSK,ph,S,207,true,"Chloroplast kinase substrates",60,19376835,"MASCOT Score",49.9800000,,,,,,-0.9785210
TIDSPGQEETGMTGVSK,ph,S,207,true,"Conserved plant phosphoproteome - Arabidopsis",61a,20466843,"MASCOT Score",75.0000000,1.0000000,,,,,
TIDSPGQEETGMTGVSK,ph,S,207,true,"srk2dei ABA signaling phopshoproteomics",83,23572148,"MASCOT Score",94.0000000,,,,,,-0.0019000
TIDSPGQEETGMTGVSK,ph,S,207,true,"LAXIC - ABA stress",84a,23660473,XCorr,4.6300000,0.9990000,,,,1.370000002332E-9,
TIDSPGQEETGMTGVSK,ph,S,207,true,"LAXIC - mannitol vs control",84b,23660473,XCorr,4.2900000,0.9990000,-1.1775068,,NO,0.011137800291181,
TIDSPGQEETGMTGVSK,ph,S,207,true,"SnRK2 protein kinase substrates",85,23776212,XCorr,4.7275648,1.0000000,,,,6.8958703195676E-5,
TIDSPGQEETGMTGVSK,ph,S,207,true,"atm and atr DNA damage response",88,25561503,"MASCOT Score",80.0000000,1.0000000,,,,,-0.2600000
TIDSPGQEETGMTGVSK,ph,S,207,true,"Protein sumoylation and phosphorylation cross-talk",97,28419593,,,,,,,,
TIDSPGQEETGMTGVSK,ph,S,207,true,"TOR Kinase and ABA Receptor",100,29290610,XCorr,5.5854502,1.0000000,,,,1.6539999592169E-7,
TIDSPGQEETGMTGVSK,ph,S,207,true,"Lateral root-induction - NAA vs control",106,23328941,"MASCOT Score",54.0000000,,0.0139708,0.9742910,NO,,
TIDSPGQEETGMTGVSK,ph,S,207,true,"Phospho cell culture sucrose/TOR",109,30833711,,,0.9999320,,,,,
TIDSPGQEETGMTGVSK,ph,S,207,true,"Tissue atlas Arabidopsis - ProteomicsDB",114,32188942,"MaxQuant score",348.4800000,1.0000000,,,,0,
TIDSPGQEETGMTGVSK,ph,T,216,true,"Tissue atlas Arabidopsis - ProteomicsDB",114,32188942,"MaxQuant score",89.3740000,0.9875390,,,,0.00027371701435186,
ISEVAGSDR,ph,S,250,true,"STN8 phosphoproteome",38,21768351,"MASCOT Score",43.1800000,,,,,,0.2638090
ISEVAGSDR,ph,S,250,true,"atm and atr DNA damage response",88,25561503,"MASCOT Score",56.0000000,1.0000000,,,,,-1.1700000
ISEVAGSDR,ph,S,250,true,"Tissue atlas Arabidopsis - ProteomicsDB",114,32188942,"MaxQuant score",156.0100000,1.0000000,,,,8.2453901995905E-5,
DKIEGMTGANVR,og,T,284,true,"O-GlcNac Inflorescence Tissue",81,28154133,"MASCOT Score",31.8000000,,,,,,4.5000000
DKIEGMTGANVR,ph,T,284,true,"Tissue atlas Arabidopsis - ProteomicsDB",114,32188942,"MaxQuant score",77.7760000,1.0000000,,,,0.0097382804378867,
