Peptide,PTM,ModifiedAA,ModifiedPosition,PeptideUniqueToGene,ExperimentDesc,ExpID,PubmedID,ScoreType,IdentScore,LocProb,Log2FChange,PQ-val,QuantSig,PEP,MassErrorPPM
QFKTALLQR,ac,K,87,false,"Quantitative Acetylproteomics",101,29440448,,,,,,,,
MWSFYILSLQAMIIIAWNGSGK,ph,S,489,true,"srk2dei ABA signaling phopshoproteomics",83,23572148,"MASCOT Score",46.0000000,,,,,,-0.0057000
MWSFYILSLQAMIIIAWNGSGK,ph,S,501,true,"srk2dei ABA signaling phopshoproteomics",83,23572148,"MASCOT Score",46.0000000,,,,,,-0.0057000
GIMATFTR,ph,T,795,true,"atm and atr DNA damage response",88,25561503,"MASCOT Score",37.0000000,1.0000000,,,,,-0.0600000
GIMATFTR,ph,T,795,true,"Tissue atlas Arabidopsis - ProteomicsDB",114,32188942,"MaxQuant score",128.2700000,0.9936260,,,,0.0030760099180043,
RLSVDSYMTCAVR,ph,S,883,true,"Brassinosteroid-Regulated Phosphorylation Dynamics",94,26187819,"MaxQuant Score",93.2690000,1.0000000,,,,0.017000000923872,-0.4920000
RLSVDSYMTCAVR,ph,T,889,true,"Brassinosteroid-Regulated Phosphorylation Dynamics",94,26187819,"MaxQuant Score",93.2690000,0.9930000,,,,0.017000000923872,-0.4920000
DIMDEEVPSMLESTHNGTYVK,ph,S,992,true,"Tissue atlas Arabidopsis - ProteomicsDB",114,32188942,"MaxQuant score",224.9300000,0.8489870,,,,0,
DIMDEEVPSMLESTHNGTYVK,ph,T,993,true,"atm and atr DNA damage response",88,25561503,"MASCOT Score",40.0000000,0.9200000,,,,,1.0200000
YDVMTPLHQQR,ph,T,1005,false,"Tissue atlas Arabidopsis - ProteomicsDB",114,32188942,"MaxQuant score",66.2850000,0.9998970,,,,0.0027697801124305,
