Peptide,PTM,ModifiedAA,ModifiedPosition,PeptideUniqueToGene,ExperimentDesc,ExpID,PubmedID,ScoreType,IdentScore,LocProb,Log2FChange,PQ-val,QuantSig,PEP,MassErrorPPM
QQSFNGIIINQTQENQTK,ph,S,19,true,"Tissue atlas Arabidopsis - ProteomicsDB",114,32188942,"MaxQuant score",272.4200000,1.0000000,,,,0,
QVSFQGVNVENYQQSR,ph,S,61,true,"Phosphorylation Early Elicitor Signaling",23,17317660,,,,,,,,
QVSFQGVNVENYQQSR,ph,S,61,true,"atm and atr DNA damage response",88,25561503,"MASCOT Score",70.0000000,1.0000000,,,,,0.0700000
QVSFQGVNVENYQQSR,ph,S,61,true,"TOR Kinase and ABA Receptor",100,29290610,XCorr,5.3297129,1.0000000,,,,5.9889998738072E-8,
QVSFQGVNVENYQQSR,ph,S,61,true,"Lateral root-induction - NAA vs control",106,23328941,"MASCOT Score",41.0000000,,,,,,
QVSFQGVNVENYQQSR,ph,S,61,true,"Tissue atlas Arabidopsis - ProteomicsDB",114,32188942,"MaxQuant score",382.2400000,1.0000000,,,,0,
LPSFGR,ph,S,103,true,"srk2dei ABA signaling phopshoproteomics",83,23572148,"MASCOT Score",26.0000000,,,,,,0.0008000
QLSFIGER,ph,S,135,true,"Chloroplast kinase substrates",60,19376835,"MASCOT Score",40.7600000,,,,,,1.5183300
QLSFIGER,ph,S,135,true,"srk2dei ABA signaling phopshoproteomics",83,23572148,"MASCOT Score",29.0000000,,,,,,0.0008000
QLSFIGER,ph,S,135,true,"atm and atr DNA damage response",88,25561503,"MASCOT Score",41.0000000,1.0000000,,,,,-0.2600000
QLSFIGER,ph,S,135,true,"TOR Kinase and ABA Receptor",100,29290610,XCorr,3.0724733,1.0000000,,,,0.0019970000721514,
QLSFIGER,ph,S,135,true,"Lateral root-induction - NAA vs control",106,23328941,"MASCOT Score",39.0000000,,,,,,
QLSFIGER,ph,S,135,true,"Tissue atlas Arabidopsis - ProteomicsDB",114,32188942,"MaxQuant score",204.2800000,1.0000000,,,,5.258540117562E-14,
QTVSDIKHEVQSQLQQSR,ph,T,437,false,"Large-scale phosphorylation discovery",44,23111157,XCorr,3.2890000,,,,,,
QTVSDIKHEVQSQLQQSR,ph,T,437,false,"Tissue atlas Arabidopsis - ProteomicsDB",114,32188942,"MaxQuant score",93.5000000,0.8258900,,,,1.0801400094351E-5,
QTVSDIKHEVQSQLQQSR,ph,S,439,false,"Tissue atlas Arabidopsis - ProteomicsDB",114,32188942,"MaxQuant score",101.6000000,0.9910770,,,,3.9157899323072E-7,
SQSFSMSR,ph,S,638,true,"atm and atr DNA damage response",88,25561503,"MASCOT Score",24.0000000,0.9930000,,,,,-0.1600000
SQSFSMSR,ph,S,638,true,"TOR Kinase and ABA Receptor",100,29290610,XCorr,2.8040829,0.8916000,,,,0.005394000094384,
SQSFSMSR,ph,S,638,true,"Tissue atlas Arabidopsis - ProteomicsDB",114,32188942,"MaxQuant score",126.2900000,0.9999810,,,,0.0029571000486612,
MPSDSDILNGEYNKR,ph,S,646,true,"atm and atr DNA damage response",88,25561503,"MASCOT Score",41.0000000,1.0000000,,,,,1.2500000
MPSDSDILNGEYNKR,ph,S,646,true,"Tissue atlas Arabidopsis - ProteomicsDB",114,32188942,"MaxQuant score",177.7600000,0.9999280,,,,1.7825500271689E-29,
MPSDSDILNGEYNK,ph,S,646,true,"atm and atr DNA damage response",88,25561503,"MASCOT Score",31.0000000,1.0000000,,,,,-0.4000000
