Peptide,PTM,ModifiedAA,ModifiedPosition,PeptideUniqueToGene,ExperimentDesc,ExpID,PubmedID,ScoreType,IdentScore,LocProb,Log2FChange,PQ-val,QuantSig,PEP,MassErrorPPM
SVDGKISDASFSEASSATPKSKVR,nt,S,62,true,"Arg/N-end rule pathway Roots",80,25728785,"MASCOT Score",44.1800000,,,,,0.0022269999608397,
SVDGKISDASFSEASSATPKSKVR,nt,S,62,true,"Stromal N-terminome",96,26371235,"MASCOT Score",45.3800000,,,,,,
SVDGKISDASFSEASSATPKSKVR,nt,S,62,true,"HUNTER N-terminome: legumain, GluC and trypsin",119,31951383,"MaxQuant score",80.7020000,,,,,,
SVDGKISDASFSEASSATPK,nt,S,62,true,"Stromal N-terminome",96,26371235,"MASCOT Score",48.4600000,,,,,,
SVDGKISDASFSE,nt,S,62,true,"Stromal N-terminome",96,26371235,"MASCOT Score",60.7600000,,,,,,
SVDGKISDASFSE,nt,S,62,true,"HUNTER N-terminome: legumain, GluC and trypsin",119,31951383,"MaxQuant score",115.2900000,,,,,,
LLEPYGICEVAR,sno,C,461,true,"hot5-4 / wildtype, FAT-switch S-nitrosoproteome",169,37277371,,,,,,,,
LLEPYGICEVAR,so,C,461,true,"S-sulfenylation site detection using YAP1C",110,32714340,,,,,,,,
