Peptide,PTM,ModifiedAA,ModifiedPosition,PeptideUniqueToGene,ExperimentDesc,ExpID,PubmedID,ScoreType,IdentScore,LocProb,Log2FChange,PQ-val,QuantSig,PEP,MassErrorPPM
SVMSSSTPQSQIIE,nt,S,37,true,"Arg/N-end rule seed, prt6 vs. Wt",99,29168982,"MASCOT Score",56.4200000,,-0.4901626,0.3337393,NO,7.5349998951424E-6,5.3302383
SSSTPQSQIIEHIVLFKTKDDAD,nta,S,40,true,"HUNTER N-terminome: legumain, GluC and trypsin",119,31951383,"MaxQuant score",40.3810000,,,,,,
SSSTPQSQIIEHIVLFK,nta,S,40,true,"Characterization plant N-terminal acetylation",6,22223895,"MASCOT Score",48.1400000,,,,,,
SSSTPQSQIIE,nta,S,40,true,"HUNTER N-terminome: legumain, GluC and trypsin",119,31951383,"MaxQuant score",101.8200000,,,,,,
STPQSQIIE,nt,S,42,true,"Arg/N-end rule seed, prt6 vs. Wt",99,29168982,"MASCOT Score",37.8700000,,-1.1090114,0.0901160,NO,0.062309999018908,1.1568361
ISSATAFTHVLHSR,ph,S,94,true,"atm and atr DNA damage response",88,25561503,"MASCOT Score",32.0000000,0.9920000,,,,,-1.5400000
ISSATAFTHVLHSR,ph,S,94,true,"Tissue atlas Arabidopsis - ProteomicsDB",114,32188942,"MaxQuant score",92.2110000,0.8835050,,,,5.4055501095718E-5,
ISSATAFTHVLHSR,ph,S,95,true,"Arabidopsis root NAA phosphoproteome",18a,27643528,"MaxQuant Score",50.0880000,0.7510000,,,,0.00037640001391992,0.0180000
ISSATAFTHVLHSR,ph,S,95,true,"Ethylene-regulated phosphorylation ein2 mutant",30,19253305,"MASCOT Score",41.9753000,,,,,,-12.1631960
ISSATAFTHVLHSR,ph,S,95,true,"atm and atr DNA damage response",88,25561503,"MASCOT Score",94.0000000,0.9100000,,,,,0.5200000
ISSATAFTHVLHSR,ph,S,95,true,"TOR Kinase and ABA Receptor",100,29290610,XCorr,2.6252124,0.8938000,,,,0.00084509997395799,
ISSATAFTHVLHSR,ph,S,95,true,"Phospho cell culture sucrose/TOR",109,30833711,,,0.9567720,,,,,
ISSATAFTHVLHSR,ph,S,95,true,"Tissue atlas Arabidopsis - ProteomicsDB",114,32188942,"MaxQuant score",156.1700000,0.9977480,,,,2.3004000093696E-10,
YESKEDLASYAAHPDHVR,ph,Y,107,true,"SnRK2 protein kinase substrates",85,23776212,XCorr,2.0098000,0.8930000,,,,0.018146699294448,
YESKEDLASYAAHPDHVR,ph,S,109,true,"Tissue atlas Arabidopsis - ProteomicsDB",114,32188942,"MaxQuant score",96.5400000,0.9993170,,,,9.6751398359629E-7,
YESKEDLASYAAHPDHVR,ac,K,110,true,"Histone deacetylases substrates - hda14 vs WT",98e,29061669,"MaxQuant Score",43.8000000,1.0000000,-0.2990000,0.6886523,NO,0.00069000001531094,
FPGIDQITVGENFSPAR,ph,S,202,true,"SnRK2 protein kinase substrates",85,23776212,XCorr,2.6818404,1.0000000,,,,0.0013443200150505,
FPGIDQITVGENFSPAR,ph,S,202,true,"TOR Kinase and ABA Receptor",100,29290610,XCorr,3.7382255,1.0000000,,,,2.2230000467971E-5,
FPGIDQITVGENFSPAR,ph,S,202,true,"Lateral root-induction - NAA vs control",106,23328941,"MASCOT Score",40.0000000,,0.0597039,0.8725375,NO,,
FPGIDQITVGENFSPAR,ph,S,202,true,"Tissue atlas Arabidopsis - ProteomicsDB",114,32188942,"MaxQuant score",224.4000000,0.9999990,,,,0,
ELVNSQKDK,ac,K,237,true,"Histone deacetylases- hda14 vs WT (low light)",98c,29061669,"MaxQuant Score",142.0000000,1.0000000,2.8020000,0.4466836,NO,0.0070000002160668,
