Peptide,PTM,ModifiedAA,ModifiedPosition,PeptideUniqueToGene,ExperimentDesc,ExpID,PubmedID,ScoreType,IdentScore,LocProb,Log2FChange,PQ-val,QuantSig,PEP,MassErrorPPM
ADESPKSIYDFTVKDIGGN,nt,A,2,true,"Arg/N-end rule seed, prt6 vs. Wt",99,29168982,"MASCOT Score",37.8100000,,,,,0.0023950000759214,-2.1969447
ADESPKSIYDF,nt,A,2,true,"Arg/N-end rule seed, prt6 vs. Wt",99,29168982,"MASCOT Score",28.7300000,,,,,0.050540000200272,-2.0295278
ADESPKSIYD,nt,A,2,true,"Arg/N-end rule seed, prt6 vs. Wt",99,29168982,"MASCOT Score",34.6400000,,,,,0.0060029998421669,0.1615484
ADESPKSIYDFTVKDIGGN,nta,A,2,true,"Arg/N-end rule seed, prt6 vs. Wt",99,29168982,"MASCOT Score",37.8100000,,0.1911985,0.7098620,NO,0.0023950000759214,-2.1969447
ADESPKSIYDFTVKDIGGN,nta,A,2,true,"HUNTER N-terminome: legumain, GluC and trypsin",119,31951383,"MaxQuant score",121.4400000,,,,,,
ADESPKSIYDF,nta,A,2,true,"Arg/N-end rule seed, prt6 vs. Wt",99,29168982,"MASCOT Score",28.7300000,,-0.3597098,0.0942808,NO,0.050540000200272,-2.0295278
ADESPKSIYD,nta,A,2,true,"Arg/N-end rule seed, prt6 vs. Wt",99,29168982,"MASCOT Score",34.6400000,,-0.2835352,0.1737860,NO,0.0060029998421669,0.1615484
ADESPKSIYD,nta,A,2,true,"HUNTER N-terminome: legumain, GluC and trypsin",119,31951383,"MaxQuant score",98.0440000,,,,,,
ADESPKSIYDFTVK,ph,S,5,true,"Tissue atlas Arabidopsis - ProteomicsDB",114,32188942,"MaxQuant score",161.7500000,0.9999820,,,,2.1178000325639E-11,
ADESPKSIYDFTVK,ub,K,7,true,"upl3 mutant / wildtype",168,35926874,"MaxQuant score",64.5200000,1.0000000,0.8447874,,,0.00042765299440362,-1.0130000
DIGGNDVSLDQYKGK,ub,K,28,true,"upl3 mutant / wildtype",168,35926874,"MaxQuant score",106.1400000,1.0000000,0.2066432,,,3.2911799507929E-7,0.0972960
CGLTDANYK,sno,C,41,true,"hot5-4 / wildtype, FAT-switch S-nitrosoproteome",169,37277371,,,,0.3088317,0.1355216,NO,,
NQFLGQEPGNNEE,nt,N,71,true,"Arg/N-end rule seed, prt6 vs. Wt",99,29168982,"MASCOT Score",27.0600000,,-0.4000028,0.0481925,NO,0.00073440000414848,-2.2569092
EQGLEILAFPCNQFLGQEPGNNEEIQQTVCTR,sno,C,89,true,"hot5-4 / wildtype, FAT-switch S-nitrosoproteome",169,37277371,,,,,,,,
FKAEFPIFDK,ac,K,93,false,"Histone deacetylases - apicidin vs control",98a,29061669,"MaxQuant Score",83.2000000,1.0000000,0.5170000,0.2123244,NO,0.00076000002445653,
VLQRYSPR,ph,S,148,true,"TOR Kinase and ABA Receptor",100,29290610,XCorr,2.7055869,0.9939000,,,,0.0036810000892729,
VLQRYSPR,ph,S,148,true,"Tissue atlas Arabidopsis - ProteomicsDB",114,32188942,"MaxQuant score",67.7260000,0.9978650,,,,0.0048161400482059,
TSPLQFEK,ph,S,152,true,"Tissue atlas Arabidopsis - ProteomicsDB",114,32188942,"MaxQuant score",77.1920000,0.8095050,,,,0.010380700230598,
DIQTALGQASS,ph,S,168,true,"Lateral root-induction - NAA vs control",106,23328941,"MASCOT Score",25.0000000,,,,,,
DIQTALGQASS,ph,S,169,true,"atm and atr DNA damage response",88,25561503,"MASCOT Score",42.0000000,0.9480000,,,,,0.6100000
