Peptide,PTM,ModifiedAA,ModifiedPosition,PeptideUniqueToGene,ExperimentDesc,ExpID,PubmedID,ScoreType,IdentScore,LocProb,Log2FChange,PQ-val,QuantSig,PEP,MassErrorPPM
EKSPAPPCGGLPPPSPSGR,ph,S,6,true,"Tissue atlas Arabidopsis - ProteomicsDB",114,32188942,"MaxQuant score",61.4370000,0.9999910,,,,0.00016183199477382,
SPAPPCGGLPPPSPSGR,sno,C,11,true,"hot5-4 / wildtype, FAT-switch S-nitrosoproteome",169,37277371,,,,0.2927287,0.0054679,NO,,
SPAPPCGGLPPPSPSGR,ph,S,18,true,"srk2dei ABA signaling phopshoproteomics",83,23572148,"MASCOT Score",45.0000000,,,,,,-0.0005000
SPAPPCGGLPPPSPSGR,ph,S,18,true,"SnRK2 protein kinase substrates",85,23776212,XCorr,2.7414660,0.9960000,,,,1.2797900126316E-5,
SPAPPCGGLPPPSPSGR,ph,S,18,true,"Phospho cell culture sucrose/TOR",109,30833711,,,0.9362630,,,,,
SPAPPCGGLPPPSPSGR,ph,S,18,true,"Col-0 callus - FC Col-0 vs. Col-0 Xray",111a,31410901,,40.4500000,,0.9307231,0.0000000,NO,,1.0870130
SPAPPCGGLPPPSPSGR,ph,S,18,true,"Col-0 X-ray callus - FC Col-0 vs. Col-0 Xray",111b,31410901,,40.4500000,,0.9307231,0.0000000,NO,,1.0870130
SPAPPCGGLPPPSPSGR,ph,S,18,true,"atm callus - FC atm vs. atm Xray",111c,31410901,,40.4500000,,1.1622690,0.0000000,NO,,1.0870130
SPAPPCGGLPPPSPSGR,ph,S,18,true,"atm-3 X-ray callus - FC atm vs. atm Xray",111d,31410901,,40.4500000,,1.1622690,0.0000000,NO,,1.0870130
SPAPPCGGLPPPSPSGR,ph,S,18,true,"Tissue atlas Arabidopsis - ProteomicsDB",114,32188942,"MaxQuant score",221.4600000,0.9954300,,,,0,
SPAPPCGGLPPPSPSGR,ph,S,18,true,"Touch-induced phosphorylation: 40s touch vs untouc",136,30291188,"MASCOT score",93.3100000,,-0.4935835,0.3068861,NO,,3.1259032
CSAFSEAGPIGHGSDANR,ph,S,36,true,"Tissue atlas Arabidopsis - ProteomicsDB",114,32188942,"MaxQuant score",184.4500000,1.0000000,,,,3.023719942975E-36,
MSHDISR,ph,S,42,true,"Tissue atlas Arabidopsis - ProteomicsDB",114,32188942,"MaxQuant score",60.7620000,0.9998170,,,,2.8122599360358E-6,
MLDNPPKKIGHR,ub,K,54,true,"Arabidopsis ubiquitination COFRADIC",40,26744219,"MaxQuant Score",46.8440000,1.0000000,,,,0.0049999998882413,0.7650000
MLDNPPKKIGHR,ub,K,55,true,"Arabidopsis ubiquitination COFRADIC",40,26744219,"MaxQuant Score",46.8440000,1.0000000,,,,0.0049999998882413,0.7650000
IRHQHSQSMDGSMNINEMLMSGNEDDSAIDAKK,ph,S,160,true,"MAPK Arabidopsis substrates",45,23172892,"MaxQuant Score",122.5100000,,,,,,
HQHSQSMDGSMNINEMLMSGNEDDSAIDAK,ph,S,162,true,"PAMP-triggered phosphorylation",48,24601666,"MASCOT Score",40.2100000,,,,,,
HQHSQSMDGSMNINEMLMSGNEDDSAIDAK,ph,S,162,true,"atm and atr DNA damage response",88,25561503,"MASCOT Score",28.0000000,0.8110000,,,,,0.0400000
IRHQHSQSMDGSMNINEMLMSGNEDDSAIDAKK,ph,S,166,true,"MAPK Arabidopsis substrates",45,23172892,"MaxQuant Score",52.4020000,,,,,,
IRHQHSQSMDGSMNINEMLMSGNEDDSAIDAK,ph,S,166,true,"MAPK Arabidopsis substrates",45,23172892,"MaxQuant Score",59.3720000,,,,,,
DTNGLTVENNELKLR,ub,K,265,true,"Arabidopsis ubiquitination COFRADIC",40,26744219,"MaxQuant Score",148.7000000,1.0000000,,,,1.5409999928731E-33,-0.7780000
