Peptide,PTM,ModifiedAA,ModifiedPosition,PeptideUniqueToGene,ExperimentDesc,ExpID,PubmedID,ScoreType,IdentScore,LocProb,Log2FChange,PQ-val,QuantSig,PEP,MassErrorPPM
QTSFSSVIR,ph,S,33,true,"Tissue atlas Arabidopsis - ProteomicsDB",114,32188942,"MaxQuant score",81.0170000,0.9709010,,,,0.0042810901068151,
DEQGVSSSRMSYSRFLEYLD,nt,D,83,true,"HUNTER N-terminome: legumain, GluC and trypsin",119,31951383,"MaxQuant score",66.8740000,,,,,,
DEQGVSSSRMSYSRFLE,nt,D,83,true,"N-terminal ChaFRADIC",92,26010716,"MASCOT Score",25.0400000,,,,,1.6169999526028E-6,
DEQGVSSSRMSYSRFLE,nt,D,83,true,"HUNTER N-terminome: legumain, GluC and trypsin",119,31951383,"MaxQuant score",81.4280000,,,,,,
DEQGVSSSR,nt,D,83,true,"N-terminal ChaFRADIC",92,26010716,"MASCOT Score",28.3900000,,,,,0.00022099999478087,
DEQGVSSSR,nt,D,83,true,"Arg/N-end rule seed, prt6 vs. Wt",99,29168982,"MASCOT Score",20.1300000,,1.0455875,0.0145583,YES,0.13549999892712,-0.5184229
FLEYLDKDR,ac,K,103,true,"Histone deacetylases - hda14 vs WT (thylakoids)",98d,29061669,"MaxQuant Score",82.3000000,1.0000000,0.4750000,0.8394600,NO,0.021999999880791,
FLEYLDKDR,ac,K,103,true,"Quantitative Acetylproteomics",101,29440448,,,,,,,,
VQLPGLSQELLQKLR,ac,K,148,false,"Histone deacetylases - hda14 vs WT (thylakoids)",98d,29061669,"MaxQuant Score",123.4000000,1.0000000,0.3770000,0.8394600,NO,9.4499998937181E-9,
QSKAKFQMEPNTGVTFDDVAGVDE,nt,Q,211,false,"HUNTER N-terminome: legumain, GluC and trypsin",119,31951383,"MaxQuant score",,,,,,,
SGGGMGGPGGPGNPLQFGQSK,ph,S,212,true,"atm and atr DNA damage response",88,25561503,"MASCOT Score",64.0000000,1.0000000,,,,,1.0400000
RSGGGMGGPGGPGNPLQFGQSKAK,ac,K,213,true,"Quantitative Acetylproteomics",101,29440448,,,,,,,,
SGGGMGGPGGPGNPLQFGQSKAK,ac,K,213,true,"Quantitative Acetylproteomics",101,29440448,,,,,,,,
FTAVGAKIPK,ac,K,258,true,"Quantitative Acetylproteomics",101,29440448,,,,,,,,
ENAPCIVFVDEIDAVGR,sno,C,321,false,"hot5-4 / wildtype, FAT-switch S-nitrosoproteome",169,37277371,,,,0.2329353,0.3002108,NO,,
QRGTGIGGGNDER,ph,T,337,false,"atm and atr DNA damage response",88,25561503,"MASCOT Score",54.0000000,1.0000000,,,,,-0.7100000
GTGIGGGNDER,ph,T,337,false,"atm and atr DNA damage response",88,25561503,"MASCOT Score",45.0000000,1.0000000,,,,,-0.2500000
QLLTEMDGFEGN,nt,Q,352,false,"HUNTER N-terminome: legumain, GluC and trypsin",119,31951383,"MaxQuant score",91.5490000,,,,,,
ADILDSALLRPGR,ph,S,380,false,"atm and atr DNA damage response",88,25561503,"MASCOT Score",36.0000000,1.0000000,,,,,-0.8300000
QVSVDVPDVKGR,nt,Q,391,false,"HUNTER N-terminome: legumain, GluC and trypsin",119,31951383,"MaxQuant score",52.7900000,,,,,,
QVSVDVPDVK,ph,S,393,false,"atm and atr DNA damage response",88,25561503,"MASCOT Score",56.0000000,1.0000000,,,,,0.2300000
QVSVDVPDVK,ph,S,393,false,"Tissue atlas Arabidopsis - ProteomicsDB",114,32188942,"MaxQuant score",186.3600000,1.0000000,,,,4.2264500232925E-10,
QVSVDVPDVKGR,ac,K,400,false,"Quantitative Acetylproteomics",101,29440448,,,,,,,,
TDILKVHAGNK,ac,K,407,true,"Histone deacetylases - hda14 vs WT (thylakoids)",98d,29061669,"MaxQuant Score",67.9000000,1.0000000,0.1220000,0.9571941,NO,0.00043600000208244,
IVAGMEGTVMTDGKSK,ac,K,480,false,"Quantitative Acetylproteomics",101,29440448,,,,,,,,
SLVAYHEVGHAVCGTLTPGHDAVQK,sno,C,495,true,"hot5-4 / wildtype, FAT-switch S-nitrosoproteome",169,37277371,,,,0.5681102,0.0013877,NO,,
VGDLQQITGLAR,nt,V,564,true,"N-terminal ChaFRADIC",92,26010716,"MASCOT Score",56.0000000,,,,,1.9529999917722E-5,
