Peptide,PTM,ModifiedAA,ModifiedPosition,PeptideUniqueToGene,ExperimentDesc,ExpID,PubmedID,ScoreType,IdentScore,LocProb,Log2FChange,PQ-val,QuantSig,PEP,MassErrorPPM
ASNGASPRIVD,nt,A,2,true,"Arg/N-end rule seed, prt6 vs. Wt",99,29168982,"MASCOT Score",28.3200000,,,,,0.045589998364449,-0.1592438
ASNGASPRIVDATE,nta,A,2,true,"HUNTER N-terminome: legumain, GluC and trypsin",119,31951383,"MaxQuant score",142.8900000,,,,,,
ASNGASPRIVD,nta,A,2,true,"Arg/N-end rule seed, prt6 vs. Wt",99,29168982,"MASCOT Score",28.3200000,,,,,0.045589998364449,-0.1592438
IVDATENSLDK,ph,S,17,true,"Tissue atlas Arabidopsis - ProteomicsDB",114,32188942,"MaxQuant score",131.3200000,0.9999920,,,,3.5899900012737E-6,
IVCVEFER,so,C,263,true,"S-sulfenylation site detection using YAP1C",110,32714340,,,,,,,,
LKELEEKTFTLSK,ub,K,290,true,"upl3 mutant / wildtype",168,35926874,"MaxQuant score",47.7740000,0.9980000,,,,0.0065603000111878,-0.6610700
ACLSISR,ph,S,419,true,"Tissue atlas Arabidopsis - ProteomicsDB",114,32188942,"MaxQuant score",103.8200000,0.9987660,,,,0.0107864998281,
TASIPGENVVHMSEEQVVNAQPPVGENEWNDIQATEAR,ph,T,423,true,"TOR Kinase and ABA Receptor",100,29290610,XCorr,3.8302214,0.7589000,,,,0.002771999919787,
DRRNSLDIPVVSPEPNVPR,ph,S,478,true,"SnRK2 protein kinase substrates",85,23776212,XCorr,3.6973703,1.0000000,,,,3.96250006599E-16,
DRRNSLDIPVVSPEPNVPR,ph,S,478,true,"TOR Kinase and ABA Receptor",100,29290610,XCorr,5.1141429,1.0000000,,,,2.3199999699131E-9,
RNSLDIPVVSPEPNVPR,ph,S,478,true,"STN8 phosphoproteome",38,21768351,"MASCOT Score",64.7600000,,,,,,-2.1103500
RNSLDIPVVSPEPNVPR,ph,S,478,true,"srk2dei ABA signaling phopshoproteomics",83,23572148,"MASCOT Score",30.0000000,,,,,,0.0004000
RNSLDIPVVSPEPNVPR,ph,S,478,true,"LAXIC - mannitol vs control",84b,23660473,XCorr,3.2100000,0.9330000,,,,0.042941100895405,
RNSLDIPVVSPEPNVPR,ph,S,478,true,"SnRK2 protein kinase substrates",85,23776212,XCorr,3.0820987,0.9890000,,,,4.3849499320459E-7,
RNSLDIPVVSPEPNVPR,ph,S,478,true,"atm and atr DNA damage response",88,25561503,"MASCOT Score",52.0000000,1.0000000,,,,,-0.1900000
RNSLDIPVVSPEPNVPR,ph,S,478,true,"TOR Kinase and ABA Receptor",100,29290610,XCorr,4.8626609,0.9953000,,,,1.6349999896192E-6,
RNSLDIPVVSPEPNVPR,ph,S,478,true,"Tissue atlas Arabidopsis - ProteomicsDB",114,32188942,"MaxQuant score",191.7800000,1.0000000,,,,3.6830803979327E-39,
RNSLDIPVVSPEPNVPR,ph,S,478,true,"Touch-induced phosphorylation: 40s touch vs untouc",136,30291188,"MASCOT score",72.5900000,,0.0786003,0.5572380,NO,,1.5294285
NSLDIPVVSPEPNVPR,ph,S,478,true,"STN8 phosphoproteome",38,21768351,"MASCOT Score",81.3500000,,,,,,-1.2726100
NSLDIPVVSPEPNVPR,ph,S,478,true,"LAXIC - mannitol vs control",84b,23660473,XCorr,3.8600000,1.0000000,,,,7.9099999084065E-7,
NSLDIPVVSPEPNVPR,ph,S,478,true,"Touch-induced phosphorylation: 40s touch vs untouc",136,30291188,"MASCOT score",73.7000000,,0.1204124,0.8503397,NO,,2.8262976
RNSLDIPVVSPEPNVPR,ph,S,485,true,"Tissue atlas Arabidopsis - ProteomicsDB",114,32188942,"MaxQuant score",170.1600000,1.0000000,,,,3.3462299211126E-19,
NSLDIPVVSPEPNVPR,ph,S,485,true,"Pollen phosphoproteome Arabidopsis",43,22631563,"MASCOT Score",55.5900000,,,,,,-1.5151800
NSLDIPVVSPEPNVPR,ph,S,485,true,"Lateral root-induction - NAA vs control",106,23328941,"MASCOT Score",29.0000000,,,,,,
