Peptide,PTM,ModifiedAA,ModifiedPosition,PeptideUniqueToGene,ExperimentDesc,ExpID,PubmedID,ScoreType,IdentScore,LocProb,Log2FChange,PQ-val,QuantSig,PEP,MassErrorPPM
VLTIYAPLFASSKRAVVTLVE,nt,V,2,true,"N-terminal ChaFRADIC",92,26010716,"MASCOT Score",20.8500000,,,,,0.00024120000307448,
VLTIYAPLFASSKR,nt,V,2,true,"Arg/N-end rule pathway Roots",80,25728785,"MASCOT Score",50.6800000,,,,,0.0029760000761598,
VLTIYAPLFASSKR,nt,V,2,true,"N-terminal ChaFRADIC",92,26010716,"MASCOT Score",32.0900000,,,,,9.1899998722056E-9,
VLTIYAPLFASSKR,nt,V,2,true,"Stromal N-terminome",96,26371235,"MASCOT Score",41.8300000,,,,,,
VLTIYAPLFASSKR,nt,V,2,true,"HUNTER N-terminome: legumain, GluC and trypsin",119,31951383,"MaxQuant score",147.3500000,,,,,,
VLTIYAPLFASSKR,nt,V,2,true,"Arabidopsis translation initiation landscape - NT",167b,35069635,,,,,,,,
VLTIYAPLFASS,nt,V,2,true,"N-terminal ChaFRADIC",92,26010716,"MASCOT Score",77.6000000,,,,,3.8179999251042E-7,
VLTIYAPLFAS,nt,V,2,true,"N-terminal ChaFRADIC",92,26010716,"MASCOT Score",65.6100000,,,,,3.3470001653768E-5,
VLTIYAPLFA,nt,V,2,true,"N-terminal ChaFRADIC",92,26010716,"MASCOT Score",41.0500000,,,,,0.0010570000158623,
VLTIYAPL,nt,V,2,true,"Arg/N-end rule seed, prt6 vs. Wt",99,29168982,"MASCOT Score",51.9700000,,-0.7920282,0.1744423,NO,0.07311999797821,-0.3051790
VLTIYAPLFASSK,ph,S,13,true,"Lateral root-induction - NAA vs control",106,23328941,"MASCOT Score",23.0000000,,,,,,
VLTIYAPLFASSKR,ac,K,14,true,"Quantitative Acetylproteomics",101,29440448,,,,,,,,
VLTIYAPLFASSKR,ub,K,14,true,"Ubiquitination Membrane Proteins",120,33585938,,,,,,,,
VLTIYAPLFASSKR,ub,K,14,true,"upl3 mutant / wildtype",168,35926874,"MaxQuant score",112.0800000,1.0000000,-0.9132162,0.1696030,NO,2.230100108136E-6,0.9141700
GVSFETVNVDLMK,ph,S,26,true,"Tissue atlas Arabidopsis - ProteomicsDB",114,32188942,"MaxQuant score",68.2620000,0.9988800,,,,0.0010319800348952,
GVSFETVNVDLMKGEQR,ub,K,36,true,"upl3 mutant / wildtype",168,35926874,"MaxQuant score",80.4880000,1.0000000,-1.5187011,,,1.8076800188283E-5,1.3668000
QPEYLAIQPFGKIPVLVDGDYKIFESR,nt,Q,41,true,"HUNTER N-terminome: legumain, GluC and trypsin",119,31951383,"MaxQuant score",58.8770000,,,,,,
IPVLVDGDYKIFESR,ub,K,62,true,"upl3 mutant / wildtype",168,35926874,"MaxQuant score",100.1100000,1.0000000,-0.0043346,0.9952400,NO,2.1602099309348E-7,-0.2751200
SQGPDLLGKTIEER,nt,S,79,true,"Arabidopsis translation initiation landscape - NT",167b,35069635,,,,,,,,
YRSQGPDLLGK,ph,S,79,false,"srk2dei ABA signaling phopshoproteomics",83,23572148,"MASCOT Score",38.0000000,,,,,,0.0005000
YRSQGPDLLGK,ph,S,79,false,"atm and atr DNA damage response",88,25561503,"MASCOT Score",50.0000000,1.0000000,,,,,-0.7900000
YRSQGPDLLGK,ph,S,79,false,"Tissue atlas Arabidopsis - ProteomicsDB",114,32188942,"MaxQuant score",107.1100000,0.9999740,,,,6.8009801907465E-5,
SQGPDLLGKTIEER,ub,K,87,true,"upl3 mutant / wildtype",168,35926874,"MaxQuant score",81.6320000,1.0000000,1.2951352,,,3.7566700484604E-5,-0.8319100
