Peptide,PTM,ModifiedAA,ModifiedPosition,PeptideUniqueToGene,ExperimentDesc,ExpID,PubmedID,ScoreType,IdentScore,LocProb,Log2FChange,PQ-val,QuantSig,PEP,MassErrorPPM
METEKDKER,nta,M,17,true,"Arabidopsis translation initiation landscape - NTA",167a,35069635,,,,,,,,
MSYSSSSSPSPSSASSSAASSLAAK,fuc,S,34,true,"SPINDLY O-fucosylation",162,36739885,,,,,,,0.68000000715256,
MSYSSSSSPSPSSASSSAASSLAAK,fuc,S,40,true,"SPINDLY O-fucosylation",162,36739885,,,,,,,0.15999999642372,
MSYSSSSSPSPSSASSSAASSLAAK,fuc,S,45,true,"SPINDLY O-fucosylation",162,36739885,,,,,,,0.34999999403954,
MSYSSSSSPSPSSASSSAASSLAAK,fuc,S,47,true,"SPINDLY O-fucosylation",162,36739885,,,,,,,0.80000001192093,
DSSLSSAYSSPSSAPVPTPPK,ph,S,75,true,"Tissue atlas Arabidopsis - ProteomicsDB",114,32188942,"MaxQuant score",208.3700000,0.9297100,,,,0,
AYEYTSMKSLNEPK,ph,S,100,true,"atm and atr DNA damage response",88,25561503,"MASCOT Score",21.0000000,1.0000000,,,,,-1.0600000
AYEYTSMKSLNEPK,ph,S,100,true,"Tissue atlas Arabidopsis - ProteomicsDB",114,32188942,"MaxQuant score",157.1500000,0.9995130,,,,6.4877301590764E-18,
AFLDEDDPNQLPQSPKR,ph,S,131,true,"STN8 phosphoproteome",38,21768351,"MASCOT Score",62.0300000,,,,,,-0.5555290
AFLDEDDPNQLPQSPKR,ph,S,131,true,"Chloroplast kinase substrates",60,19376835,"MASCOT Score",58.2900000,,,,,,-0.5555290
AFLDEDDPNQLPQSPKR,ph,S,131,true,"atm and atr DNA damage response",88,25561503,"MASCOT Score",43.0000000,1.0000000,,,,,-0.2400000
AFLDEDDPNQLPQSPKR,ph,S,131,true,"Protein sumoylation and phosphorylation cross-talk",97,28419593,,,,,,,,
AFLDEDDPNQLPQSPKR,ph,S,131,true,"Tissue atlas Arabidopsis - ProteomicsDB",114,32188942,"MaxQuant score",271.9700000,1.0000000,,,,0,
AFLDEDDPNQLPQSPK,ph,S,131,true,"Arabidopsis root NAA phosphoproteome",18a,27643528,"MaxQuant Score",43.4760000,1.0000000,,,,0.0010000000474975,-0.6300000
AFLDEDDPNQLPQSPK,ph,S,131,true,"STN8 phosphoproteome",38,21768351,"MASCOT Score",71.6100000,,,,,,-1.5132600
AFLDEDDPNQLPQSPK,ph,S,131,true,"Phosphoproteomic analysis of seed maturation",42,22440515,"MASCOT Score",55.0000000,,,,,,-1.4100000
AFLDEDDPNQLPQSPK,ph,S,131,true,"Pollen phosphoproteome Arabidopsis",43,22631563,"MASCOT Score",38.8100000,,,,,,-0.4804800
AFLDEDDPNQLPQSPK,ph,S,131,true,"Large-scale phosphorylation discovery",44,23111157,XCorr,3.9290000,,,,,,
AFLDEDDPNQLPQSPK,ph,S,131,true,"Tyrosine phosphorylation in Arabidopsis",59,18463617,"MASCOT Score",67.0000000,,,,,,-1.4792771
AFLDEDDPNQLPQSPK,ph,S,131,true,"Chloroplast kinase substrates",60,19376835,"MASCOT Score",86.6800000,,,,,,-0.1938860
AFLDEDDPNQLPQSPK,ph,S,131,true,"srk2dei ABA signaling phopshoproteomics",83,23572148,"MASCOT Score",68.0000000,,,,,,-0.0005000
AFLDEDDPNQLPQSPK,ph,S,131,true,"LAXIC - ABA stress",84a,23660473,XCorr,4.7300000,1.0000000,,,,0.0030860400293022,
AFLDEDDPNQLPQSPK,ph,S,131,true,"SnRK2 protein kinase substrates",85,23776212,XCorr,3.6922221,1.0000000,,,,0.00054242997430265,
AFLDEDDPNQLPQSPK,ph,S,131,true,"atm and atr DNA damage response",88,25561503,"MASCOT Score",35.0000000,1.0000000,,,,,0.1800000
AFLDEDDPNQLPQSPK,ph,S,131,true,"TOR Kinase and ABA Receptor",100,29290610,XCorr,5.1603246,1.0000000,,,,7.0870000854484E-6,
AFLDEDDPNQLPQSPK,ph,S,131,true,"Lateral root-induction - NAA vs control",106,23328941,"MASCOT Score",56.0000000,,,,,,
AFLDEDDPNQLPQSPK,ph,S,131,true,"Phospho cell culture sucrose/TOR",109,30833711,,,1.0000000,,,,,
AFLDEDDPNQLPQSPK,ph,S,131,true,"Touch-induced phosphorylation: 40s touch vs untouc",136,30291188,"MASCOT score",55.7200000,,0.0892598,0.2815328,NO,,6.7774998
MEQSIPSATTSGTKEAGQTGR,ub,K,148,true,"Arabidopsis ubiquitination COFRADIC",40,26744219,"MaxQuant Score",43.6960000,1.0000000,,,,0.0020000000949949,-0.2120000
LAHENSIYTR,ph,S,309,true,"Tissue atlas Arabidopsis - ProteomicsDB",114,32188942,"MaxQuant score",92.2950000,0.9987960,,,,0.0024335400667042,
