Peptide,PTM,ModifiedAA,ModifiedPosition,PeptideUniqueToGene,ExperimentDesc,ExpID,PubmedID,ScoreType,IdentScore,LocProb,Log2FChange,PQ-val,QuantSig,PEP,MassErrorPPM
ATEGKNPINMNSMSSSLAR,nt,A,2,true,"N-terminal ChaFRADIC",92,26010716,"MASCOT Score",50.1800000,,,,,3.311999989819E-6,
ATEGKNPINM,nt,A,2,true,"N-term acetylation drought responses",5,26184543,,,,,,,,
ATEGKNPINMNSMSSSLAR,nta,A,2,true,"N-terminal ChaFRADIC",92,26010716,"MASCOT Score",50.1800000,,,,,3.311999989819E-6,
ATEGKNPINMNSMSSSLAR,nta,A,2,true,"FtsH12 N-terminome: WT / FtsH12 knockdown miRNA",118,33216923,"MaxQuant score",46.4150000,,,,,0.00020819999917876,
ATEGKNPINMNSMSSSLAR,nta,A,2,true,"HUNTER N-terminome: legumain, GluC and trypsin",119,31951383,"MaxQuant score",95.6580000,,,,,,
ATEGKNPINM,nta,A,2,true,"N-term acetylation drought responses",5,26184543,,,,,,,,
NPINMNSMSSSLAR,ph,S,13,true,"srk2dei ABA signaling phopshoproteomics",83,23572148,"MASCOT Score",60.0000000,,,,,,0.0023000
NPINMNSMSSSLAR,ph,S,13,true,"Tissue atlas Arabidopsis - ProteomicsDB",114,32188942,"MaxQuant score",145.1900000,0.9417410,,,,1.5040300409661E-18,
NPINMNSMSSSLAR,ph,S,15,true,"atm and atr DNA damage response",88,25561503,"MASCOT Score",37.0000000,0.9560000,,,,,-0.5500000
NPINMNSMSSSLAR,ph,S,15,true,"Tissue atlas Arabidopsis - ProteomicsDB",114,32188942,"MaxQuant score",214.0800000,0.9100410,,,,0,
NPINMNSMSSSLAR,ph,S,16,true,"srk2dei ABA signaling phopshoproteomics",83,23572148,"MASCOT Score",41.0000000,,,,,,0.0017000
NPINMNSMSSSLAR,ph,S,16,true,"Tissue atlas Arabidopsis - ProteomicsDB",114,32188942,"MaxQuant score",175.6600000,0.8340780,,,,6.9302601235456E-17,
NPINMNSMSSSLAR,ph,S,17,true,"Large-scale phosphorylation discovery",44,23111157,XCorr,4.3590000,,,,,,
NPINMNSMSSSLAR,ph,S,17,true,"Tissue atlas Arabidopsis - ProteomicsDB",114,32188942,"MaxQuant score",118.2000000,0.7926730,,,,5.9135397967314E-11,
CVDVVGAK,sno,C,166,true,"hot5-4 / wildtype, FAT-switch S-nitrosoproteome",169,37277371,,,,,,,,
GVKYSDPGDNESDER,ub,K,243,true,"upl3 mutant / wildtype",168,35926874,"MaxQuant score",107.8200000,1.0000000,0.5964581,0.5716800,NO,2.8007400487695E-7,-0.3636200
IISAFVEKEK,ub,K,345,true,"upl3 mutant / wildtype",168,35926874,"MaxQuant score",53.2370000,1.0000000,2.3651326,,,0.0048233401030302,1.5852000
FNAIANLVPKSAR,ac,K,400,true,"Quantitative Acetylproteomics",101,29440448,,,,,,,,
EKVCSSMDPLK,ub,K,430,true,"upl3 mutant / wildtype",168,35926874,"MaxQuant score",108.5600000,1.0000000,2.7744181,0.0279570,YES,6.3749801483937E-5,-0.8791500
AVVVLPEALKTR,ub,K,490,true,"Ubiquitination Membrane Proteins",120,33585938,,,,,,,,
AVVVLPEALKTR,ub,K,490,true,"upl3 mutant / wildtype",168,35926874,"MaxQuant score",88.0210000,1.0000000,2.3219281,0.1649440,NO,0.00014063599519432,-0.2059400
TRSQLQADTTLAK,ph,T,491,true,"srk2dei ABA signaling phopshoproteomics",83,23572148,"MASCOT Score",25.0000000,,,,,,-0.0004000
AVVVLPEALKTR,ph,T,491,true,"Tissue atlas Arabidopsis - ProteomicsDB",114,32188942,"MaxQuant score",154.8800000,1.0000000,,,,3.9802898754715E-9,
TRSQLQADTTLAK,ph,S,493,true,"Large-scale phosphorylation discovery",44,23111157,XCorr,4.5360000,,,,,,
TRSQLQADTTLAK,ph,S,493,true,"srk2dei ABA signaling phopshoproteomics",83,23572148,"MASCOT Score",39.0000000,,,,,,-0.0010000
TRSQLQADTTLAK,ph,S,493,true,"atm and atr DNA damage response",88,25561503,"MASCOT Score",38.0000000,0.9470000,,,,,-1.4500000
TRSQLQADTTLAK,ph,S,493,true,"TOR Kinase and ABA Receptor",100,29290610,XCorr,4.8712096,0.9225000,,,,2.0470000094974E-7,
SQLQADTTLAK,ph,S,493,true,"Tissue atlas Arabidopsis - ProteomicsDB",114,32188942,"MaxQuant score",193.4100000,0.9999970,,,,4.3523300881003E-30,
SQLQADTTLAK,ph,T,500,true,"Tissue atlas Arabidopsis - ProteomicsDB",114,32188942,"MaxQuant score",146.4300000,0.8705100,,,,9.3656502997419E-8,
ENEALRSELMK,mox,M,513,true,"cat2 Methionine oxidation - 3h stress",62b,25693801,"MASCOT Score",51.0000000,,0.2156065,,NO,,
HTFFSSVSKK,ph,S,554,true,"atm and atr DNA damage response",88,25561503,"MASCOT Score",32.0000000,1.0000000,,,,,-2.4800000
HTFFSSVSK,ph,S,554,true,"atm and atr DNA damage response",88,25561503,"MASCOT Score",49.0000000,0.9950000,,,,,-2.4300000
HTFFSSVSK,ph,S,554,true,"Tissue atlas Arabidopsis - ProteomicsDB",114,32188942,"MaxQuant score",119.0500000,0.9826370,,,,0.00021857599494979,
