Peptide,PTM,ModifiedAA,ModifiedPosition,PeptideUniqueToGene,ExperimentDesc,ExpID,PubmedID,ScoreType,IdentScore,LocProb,Log2FChange,PQ-val,QuantSig,PEP,MassErrorPPM
MDGVGESSTQNEVEEKPVIVR,nta,M,1,true,"Characterization plant N-terminal acetylation",6,22223895,"MASCOT Score",50.1900000,,,,,,
MDGVGESSTQNEVEEKPVIVR,nta,M,1,true,"Arg/N-end rule seed, prt6 vs. Wt",99,29168982,"MASCOT Score",58.2500000,,0.0984841,0.8247106,NO,1.3159999980417E-5,-0.9098942
MDGVGESSTQNEVEEKPVIVR,nta,M,1,true,"Arabidopsis translation initiation landscape - NTA",167a,35069635,,,,,,,,
MDGVGESSTQNEVEEKPVIVR,ub,K,16,true,"Arabidopsis ubiquitination COFRADIC",40,26744219,"MaxQuant Score",59.9750000,1.0000000,,,,1.708999966283E-13,-0.6420000
RPTLDFSK,ph,T,47,true,"Tissue atlas Arabidopsis - ProteomicsDB",114,32188942,"MaxQuant score",127.0300000,0.9999990,,,,0.006997549906373,
RPTLDFSKLSISDSGER,ph,S,54,true,"Tissue atlas Arabidopsis - ProteomicsDB",114,32188942,"MaxQuant score",110.8900000,0.9891950,,,,2.377960051092E-9,
LSISDSGER,ph,S,56,true,"Tissue atlas Arabidopsis - ProteomicsDB",114,32188942,"MaxQuant score",91.8080000,0.9321390,,,,5.6860199038056E-7,
LSISDSGERGPSVAEDVKPK,ph,S,58,true,"Tissue atlas Arabidopsis - ProteomicsDB",114,32188942,"MaxQuant score",110.8900000,0.9670150,,,,3.7428502137893E-12,
DNAQEFTSLEDQK,ph,S,183,true,"Tissue atlas Arabidopsis - ProteomicsDB",114,32188942,"MaxQuant score",230.2600000,0.9649210,,,,0,
