Peptide,PTM,ModifiedAA,ModifiedPosition,PeptideUniqueToGene,ExperimentDesc,ExpID,PubmedID,ScoreType,IdentScore,LocProb,Log2FChange,PQ-val,QuantSig,PEP,MassErrorPPM
MDPNESPPNQFR,nta,M,1,true,"Characterization plant N-terminal acetylation",6,22223895,"MASCOT Score",55.2500000,,,,,,
MDPNESPPNQFR,nta,M,1,true,"Arg/N-end rule seed, prt6 vs. Wt",99,29168982,"MASCOT Score",34.8400000,,,,,0.093170002102852,-2.7515353
MDPNESPPNQFR,nta,M,1,true,"HUNTER N-terminome: legumain, GluC and trypsin",119,31951383,"MaxQuant score",86.3440000,,,,,,
MDPNESPPNQ,nta,M,1,true,"N-term acetylation drought responses",5,26184543,,,,,,,,
MDPNESPPNQFR,ph,S,6,true,"Tissue atlas Arabidopsis - ProteomicsDB",114,32188942,"MaxQuant score",92.2950000,1.0000000,,,,5.7188201026293E-5,
LCFDELPGAR,ox,C,202,true,"SPEAR - 50 mM H2O2 / mock",138b,34619326,,,,-1.3601278,0.0113218,YES,,
LCFDELPGAR,sno,C,202,true,"Site-specific nitrosomeproteomic id - gsnor1-3",90a,25699590,XCorr,2.0465822,,,,,0.0044769998639822,-7.1250595
LCFDELPGAR,sno,C,202,true,"Site-specific nitrosomeproteomic id - gsnor1-3",90b,25699590,XCorr,2.0683329,,,,,0.12219999730587,-6.8920599
ACDLSEISR,sno,C,424,true,"hot5-4 / wildtype, FAT-switch S-nitrosoproteome",169,37277371,,,,,,,,
ACDLSEISR,so,C,424,true,"S-sulfenylation site detection using YAP1C",110,32714340,,,,,,,,
