Peptide,PTM,ModifiedAA,ModifiedPosition,PeptideUniqueToGene,ExperimentDesc,ExpID,PubmedID,ScoreType,IdentScore,LocProb,Log2FChange,PQ-val,QuantSig,PEP,MassErrorPPM
TLTFDPPTTNSER,nt,T,55,true,"N-terminal ChaFRADIC",92,26010716,"MASCOT Score",72.3700000,,,,,0.00030320000951178,
TLTFDPPTTNSER,nt,T,55,true,"Stromal N-terminome",96,26371235,"MASCOT Score",57.3900000,,,,,,
TLTFDPPTTNSER,nt,T,55,true,"Arg/N-end rule seed, prt6 vs. Wt",99,29168982,"MASCOT Score",30.5300000,,,,,0.16189999878407,-1.9004607
TLTFDPPTTNSER,nt,T,55,true,"FtsH12 N-terminome: WT / FtsH12 knockdown miRNA",118,33216923,"MaxQuant score",195.1000000,,-0.1004936,0.5872498,NO,0,
TLTFDPPTTNSER,nt,T,55,true,"HUNTER N-terminome: legumain, GluC and trypsin",119,31951383,"MaxQuant score",116.2300000,,,,,,
TLTFDPPTTNSE,nt,T,55,true,"N-terminal ChaFRADIC",92,26010716,"MASCOT Score",37.2900000,,,,,0.0014540000120178,
TLTFDPPTTNSE,nt,T,55,true,"HUNTER N-terminome: legumain, GluC and trypsin",119,31951383,"MaxQuant score",175.0700000,,,,,,
TLTFDPPTTN,nt,T,55,true,"HUNTER N-terminome: legumain, GluC and trypsin",119,31951383,"MaxQuant score",125.8200000,,,,,,
TLTFDPPTTNSER,nta,T,55,true,"Characterization plant N-terminal acetylation",6,22223895,"MASCOT Score",52.4900000,,,,,,
TLTFDPPTTNSER,nta,T,55,true,"N-terminal ChaFRADIC",92,26010716,"MASCOT Score",72.3700000,,,,,0.00030320000951178,
TLTFDPPTTNSER,nta,T,55,true,"Stromal N-terminome",96,26371235,"MASCOT Score",43.0300000,,,,,,
TLTFDPPTTNSER,nta,T,55,true,"Arg/N-end rule seed, prt6 vs. Wt",99,29168982,"MASCOT Score",30.5300000,,,,,0.16189999878407,-1.9004607
TLTFDPPTTNSER,nta,T,55,true,"HUNTER N-terminome: legumain, GluC and trypsin",119,31951383,"MaxQuant score",54.1430000,,,,,,
TLTFDPPTTNSER,nta,T,55,true,"Arabidopsis translation initiation landscape - NTA",167a,35069635,,,,,,,,
TLTFDPPTTNSE,nta,T,55,true,"N-terminal ChaFRADIC",92,26010716,"MASCOT Score",22.0800000,,,,,0.047779999673367,
TLTFDPPTTN,nta,T,55,true,"HUNTER N-terminome: legumain, GluC and trypsin",119,31951383,"MaxQuant score",138.9800000,,,,,,
HTIDPSSPDFQPIPSFEECFPK,sno,C,91,true,"hot5-4 / wildtype, FAT-switch S-nitrosoproteome",169,37277371,,,,,,,,
QGIITEEMLYCATR,so,C,181,true,"S-sulfenylation site detection using YAP1C",110,32714340,,,,,,,,
SFHDETLPADGAKVAHF,nt,S,553,true,"Arabidopsis translation initiation landscape - NT",167b,35069635,,,,,,,,
FCSMK,ox,C,578,false,"OxiTRAQ Arabidopsis - 5 mM H2O2 versus control",47,24376095,,,,-0.1948851,0.1673757,NO,,
KYAEENGYGSAEEAIR,ph,S,597,true,"SnRK2 protein kinase substrates",85,23776212,XCorr,3.5031297,0.9990000,,,,0.010794100351632,
YAEENGYGSAEEAIR,ph,S,597,true,"LAXIC - mannitol vs control",84b,23660473,XCorr,4.4200000,0.9980000,,,,4.0100001097443E-10,
YAEENGYGSAEEAIR,ph,S,597,true,"SnRK2 protein kinase substrates",85,23776212,XCorr,3.5271609,0.9980000,,,,2.4802099929389E-8,
