Peptide,PTM,ModifiedAA,ModifiedPosition,PeptideUniqueToGene,ExperimentDesc,ExpID,PubmedID,ScoreType,IdentScore,LocProb,Log2FChange,PQ-val,QuantSig,PEP,MassErrorPPM
SVQEYLDKHMLSR,nt,S,2,true,"FtsH12 N-terminome: WT / FtsH12 knockdown miRNA",118,33216923,"MaxQuant score",106.4900000,,,,,9.9700002920144E-7,
SVQEYLDKH,nt,S,2,true,"Arg/N-end rule seed, prt6 vs. Wt",99,29168982,"MASCOT Score",43.2800000,,,,,0.085100002586842,-1.9837919
SVQEYLDKHMLSR,nta,S,2,true,"Arg/N-end rule pathway Roots",80,25728785,"MASCOT Score",38.6600000,,,,,0.012190000154078,
SVQEYLDKHMLSR,nta,S,2,true,"Arabidopsis translation initiation landscape - NTA",167a,35069635,,,,,,,,
SVQEYLDKH,nta,S,2,true,"Arg/N-end rule seed, prt6 vs. Wt",99,29168982,"MASCOT Score",43.2800000,,-0.1976732,0.2480507,NO,0.085100002586842,-1.9837919
SVQEYLDK,nta,S,2,true,"Characterization plant N-terminal acetylation",6,22223895,"MASCOT Score",61.3900000,,,,,,
KIEDAVNAAVR,ub,K,15,true,"Arabidopsis ubiquitination COFRADIC",40,26744219,"MaxQuant Score",61.3440000,1.0000000,,,,0.0060000000521541,0.8580000
ISEALIGMDPK,mox,M,124,true,"cat2 Methionine oxidation - 1h stress",62a,25693801,"MASCOT Score",43.0000000,,0.0227965,,NO,,
IAIDIAATNFCLGTK,so,C,294,true,"S-sulfenylation site detection using YAP1C",110,32714340,,,,,,,,
YDLDIKSPNK,ph,S,305,true,"Tyrosine phosphorylation in Arabidopsis",59,18463617,"MASCOT Score",38.0000000,,,,,,-1.0223514
YDLDIKSPNK,ph,S,305,true,"Conserved plant phosphoproteome - Arabidopsis",61a,20466843,"MASCOT Score",38.0000000,1.0000000,,,,,
YDLDIKSPNK,ph,S,305,true,"atm and atr DNA damage response",88,25561503,"MASCOT Score",46.0000000,1.0000000,,,,,-2.6700000
YDLDIKSPNK,ph,S,305,true,"Phospho cell culture sucrose/TOR",109,30833711,,,1.0000000,,,,,
YDLDIKSPNK,ph,S,305,true,"Tissue atlas Arabidopsis - ProteomicsDB",114,32188942,"MaxQuant score",216.8100000,1.0000000,,,,1.1390400358713E-26,
SCNALLLK,acy,C,380,false,"Arabidopsis S-acylation atlas - Meristem",163a,35681017,,,,,,,,
SCNALLLK,acy,C,380,false,"Arabidopsis S-acylation atlas - Hypocotyl",163b,35681017,,,,,,,,
SCNALLLK,acy,C,380,false,"Arabidopsis S-acylation atlas - Stem",163f,35681017,,,,,,,,
SCNALLLK,cn,C,380,false,"Cellular regulation by S-cyanylation",115,30377236,,,,,,,,
SCNALLLK,ox,C,380,false,"OxiTRAQ Arabidopsis - 5 mM H2O2 versus control",47,24376095,,,,0.0183924,0.4814494,NO,,
SCNALLLK,sno,C,380,false,"hot5-4 / wildtype, FAT-switch S-nitrosoproteome",169,37277371,,,,,,,,
AIQESSCNALLLK,so,C,380,true,"Arabidopsis S-sulfenylation chemoproteomics",108,31578252,"pFind PSM Score",0.0925264,,,,,,1.7739060
SCNALLLK,so,C,380,false,"S-sulfenylation site detection using YAP1C",110,32714340,,,,,,,,
VNQIGTVTE,nt,V,387,false,"Arg/N-end rule seed, prt6 vs. Wt",99,29168982,"MASCOT Score",43.0900000,,-0.1418989,0.5206920,NO,0.011549999937415,-3.1624399
