Peptide,PTM,ModifiedAA,ModifiedPosition,PeptideUniqueToGene,ExperimentDesc,ExpID,PubmedID,ScoreType,IdentScore,LocProb,Log2FChange,PQ-val,QuantSig,PEP,MassErrorPPM
TISGASVSANTATPLSTSLYDPYGHIDR,ph,S,68,false,"TOR Kinase and ABA Receptor",100,29290610,XCorr,3.8095200,0.9701000,,,,0.00022689999605063,
TISGASVSANTATPLSTSLYDPYGHIDR,ph,S,68,false,"Tissue atlas Arabidopsis - ProteomicsDB",114,32188942,"MaxQuant score",257.9400000,0.9999690,,,,0,
SSGPIVPGSGPLER,ph,S,115,true,"atm and atr DNA damage response",88,25561503,"MASCOT Score",51.0000000,0.9390000,,,,,-0.7500000
SSGPIVPGSGPLER,ph,S,122,true,"Large-scale phosphorylation discovery",44,23111157,XCorr,2.7400000,,,,,,
SSGPIVPGSGPLER,ph,S,122,true,"atm and atr DNA damage response",88,25561503,"MASCOT Score",51.0000000,1.0000000,,,,,-0.7500000
SSGPIVPGSGPLER,ph,S,122,true,"Tissue atlas Arabidopsis - ProteomicsDB",114,32188942,"MaxQuant score",118.1900000,1.0000000,,,,4.0865499613574E-5,
GFLSGPIER,ph,S,131,false,"Phosphorylation Early Elicitor Signaling",23,17317660,,,,,,,,
GFLSGPIER,ph,S,131,false,"srk2dei ABA signaling phopshoproteomics",83,23572148,"MASCOT Score",41.0000000,,,,,,-0.0008000
GFLSGPIER,ph,S,131,false,"SnRK2 protein kinase substrates",85,23776212,XCorr,2.1542747,1.0000000,,,,0.16877000033855,
GFLSGPIER,ph,S,131,false,"atm and atr DNA damage response",88,25561503,"MASCOT Score",38.0000000,1.0000000,,,,,0.2300000
GFLSGPIER,ph,S,131,false,"Lateral root-induction - NAA vs control",106,23328941,"MASCOT Score",31.0000000,,,,,,
GFLSGPIER,ph,S,131,false,"Phospho cell culture sucrose/TOR",109,30833711,,,1.0000000,,,,,
GFLSGPIER,ph,S,131,false,"Tissue atlas Arabidopsis - ProteomicsDB",114,32188942,"MaxQuant score",136.5000000,1.0000000,,,,9.8532196716405E-5,
GFLSGPIER,ph,S,131,false,"Touch-induced phosphorylation: 40s touch vs untouc",136,30291188,"MASCOT score",44.3200000,,0.0139397,0.8891233,NO,,9.6153063
GFMSGPLDGSSGPIDGK,ph,S,140,true,"atm and atr DNA damage response",88,25561503,"MASCOT Score",39.0000000,1.0000000,,,,,-0.5200000
GFMSGPLDGSSGPIDGK,ph,S,140,true,"Tissue atlas Arabidopsis - ProteomicsDB",114,32188942,"MaxQuant score",245.2300000,1.0000000,,,,0,
GFMSGPLDGSSGPIDGK,ph,S,147,true,"atm and atr DNA damage response",88,25561503,"MASCOT Score",32.0000000,1.0000000,,,,,-0.2100000
GFMSGPLDGSSGPIDGK,ph,S,147,true,"Tissue atlas Arabidopsis - ProteomicsDB",114,32188942,"MaxQuant score",191.2400000,0.7988700,,,,4.1518693848895E-39,
SFSHGLANLR,ph,S,162,true,"Tissue atlas Arabidopsis - ProteomicsDB",114,32188942,"MaxQuant score",88.1550000,0.9634050,,,,0.0015541800530627,
SFSHGLANLR,ph,S,164,true,"atm and atr DNA damage response",88,25561503,"MASCOT Score",46.0000000,1.0000000,,,,,0.4900000
SFSHGLANLR,ph,S,164,true,"TOR Kinase and ABA Receptor",100,29290610,XCorr,2.3851483,0.9997000,,,,0.019829999655485,
SFSHGLANLR,ph,S,164,true,"Lateral root-induction - NAA vs control",106,23328941,"MASCOT Score",35.0000000,,,,,,
SFSHGLANLR,ph,S,164,true,"Tissue atlas Arabidopsis - ProteomicsDB",114,32188942,"MaxQuant score",177.0400000,0.9999910,,,,1.8251599342989E-8,
GQNSIVAPIK,ph,S,197,false,"Tissue atlas Arabidopsis - ProteomicsDB",114,32188942,"MaxQuant score",62.0890000,1.0000000,,,,0.011966600082815,
TDAKSSDEADVENR,ph,S,317,true,"atm and atr DNA damage response",88,25561503,"MASCOT Score",63.0000000,0.9970000,,,,,0.2200000
TDAKSSDEADVENR,ph,S,317,true,"Tissue atlas Arabidopsis - ProteomicsDB",114,32188942,"MaxQuant score",160.4800000,0.9914990,,,,2.3875801336004E-10,
SSDEADVENR,ph,S,317,true,"atm and atr DNA damage response",88,25561503,"MASCOT Score",49.0000000,0.9990000,,,,,-0.1800000
