Peptide,PTM,ModifiedAA,ModifiedPosition,PeptideUniqueToGene,ExperimentDesc,ExpID,PubmedID,ScoreType,IdentScore,LocProb,Log2FChange,PQ-val,QuantSig,PEP,MassErrorPPM
AGKKPAEKKPAEK,ac,K,7,true,"Histone deacetylases- hda14 vs WT (low light)",98c,29061669,"MaxQuant Score",117.4800000,0.9910000,-1.4370000,0.9885531,NO,1.399999973728E-6,
AGKKPAEKK,ac,K,7,true,"Histone deacetylases - apicidin vs control",98a,29061669,"MaxQuant Score",99.3000000,0.9980000,0.8340000,0.0047206,YES,0.0070000002160668,
AGKKPAEKK,ac,K,7,true,"Histone deacetylases- hda14 vs WT (low light)",98c,29061669,"MaxQuant Score",117.4800000,0.8380000,-0.6990000,0.9885531,NO,3.6000000758207E-9,
AGKKPAEKKPAEKAPAEEEK,ac,K,12,true,"Quantitative Acetylproteomics",101,29440448,,,,,,,,
KPAEKKPAEKAPAEEEK,ac,K,12,true,"Quantitative Acetylproteomics",101,29440448,,,,,,,,
AGKKPAEKK,ac,K,12,true,"Histone deacetylases - apicidin vs control",98a,29061669,"MaxQuant Score",99.3000000,1.0000000,0.8340000,0.0047206,YES,0.0070000002160668,
AGKKPAEKK,ac,K,12,true,"Histone deacetylases- hda14 vs WT (low light)",98c,29061669,"MaxQuant Score",117.4800000,1.0000000,-0.6990000,0.9885531,NO,3.6000000758207E-9,
AEKKPAEK,ac,K,12,false,"Histone deacetylases- hda14 vs WT (low light)",98c,29061669,"MaxQuant Score",163.4400000,1.0000000,-2.5710000,0.9885531,NO,9.999999960042E-12,
AEKKPAEK,ac,K,12,false,"Quantitative Acetylproteomics",101,29440448,,,,,,,,
AGKKPAEKKPAEKAPAEEEK,ac,K,13,true,"Quantitative Acetylproteomics",101,29440448,,,,,,,,
KPAEKKPAEK,ac,K,13,false,"Histone deacetylases- hda14 vs WT (low light)",98c,29061669,"MaxQuant Score",120.3200000,0.9120000,-0.0150000,0.9931160,NO,3.8999999674161E-8,
AEKKPAEK,ac,K,13,false,"Histone deacetylases- hda14 vs WT (low light)",98c,29061669,"MaxQuant Score",163.4400000,1.0000000,-2.5710000,0.9885531,NO,9.999999960042E-12,
AEKKPAEK,ac,K,13,false,"Quantitative Acetylproteomics",101,29440448,,,,,,,,
KPAEKAPAEEEKVAEKAPAEK,ac,K,17,true,"Quantitative Acetylproteomics",101,29440448,,,,,,,,
AGKKPAEKKPAEKAPAEEEK,ac,K,17,true,"Quantitative Acetylproteomics",101,29440448,,,,,,,,
KPAEKKPAEKAPAEEEK,ac,K,17,true,"Histone deacetylases substrates - hda14 vs WT",98e,29061669,"MaxQuant Score",60.1000000,0.9800000,-1.1030000,0.9099133,NO,2.900000072259E-5,
KPAEKKPAEKAPAEEEK,ac,K,17,true,"Quantitative Acetylproteomics",101,29440448,,,,,,,,
KPAEKAPAEEEK,ac,K,17,true,"Histone deacetylases - apicidin vs control",98a,29061669,"MaxQuant Score",69.0000000,0.8280000,-0.6700000,0.1462177,NO,0.0080000003799796,
KPAEKAPAEEEK,ac,K,17,true,"Histone deacetylases- hda14 vs WT (low light)",98c,29061669,"MaxQuant Score",149.0700000,1.0000000,-0.9590000,0.9885531,NO,9.700000236357E-15,
KPAEKAPAEEEKVAEKAPAEK,ac,K,28,true,"Quantitative Acetylproteomics",101,29440448,,,,,,,,
AEKAPAEKKPKAGKK,ac,K,28,false,"Quantitative Acetylproteomics",101,29440448,,,,,,,,
VAEKAPAEKKPK,ac,K,28,true,"Histone deacetylases - apicidin vs control",98a,29061669,"MaxQuant Score",95.5000000,1.0000000,0.9770000,0.0068707,YES,3.4999999343199E-7,
VAEKAPAEKKPK,ac,K,28,true,"Histone deacetylases substrates - TSA vs control",98b,29061669,"MaxQuant Score",95.5000000,1.0000000,3.7330000,0.0062517,YES,3.4999999343199E-7,
VAEKAPAEKKPK,ac,K,28,true,"Histone deacetylases- hda14 vs WT (low light)",98c,29061669,"MaxQuant Score",149.0700000,1.0000000,-2.3650000,0.9885531,NO,9.700000236357E-15,
VAEKAPAEKKPK,ac,K,28,true,"Histone deacetylases - hda14 vs WT (thylakoids)",98d,29061669,"MaxQuant Score",59.2000000,1.0000000,-0.1150000,0.9862795,NO,0.0010000000474975,
VAEKAPAEKKPK,ac,K,28,true,"Histone deacetylases substrates - hda14 vs WT",98e,29061669,"MaxQuant Score",94.1000000,1.0000000,-0.0010000,0.9954054,NO,6.5999998355437E-8,
VAEKAPAEKKPK,ac,K,28,true,"Quantitative Acetylproteomics",101,29440448,,,,,,,,
AEKAPAEKKPK,ac,K,28,false,"Histone deacetylases - apicidin vs control",98a,29061669,"MaxQuant Score",136.2000000,1.0000000,0.2090000,0.6011737,NO,5.4000000612784E-18,
AEKAPAEKKPK,ac,K,28,false,"Histone deacetylases substrates - TSA vs control",98b,29061669,"MaxQuant Score",136.2000000,1.0000000,3.9610000,0.0062517,YES,5.4000000612784E-18,
AEKAPAEKKPK,ac,K,28,false,"Histone deacetylases- hda14 vs WT (low light)",98c,29061669,"MaxQuant Score",174.5900000,1.0000000,-0.1270000,0.9885531,NO,2.6000000763471E-12,
AEKAPAEKKPK,ac,K,28,false,"Histone deacetylases - hda14 vs WT (thylakoids)",98d,29061669,"MaxQuant Score",120.9000000,1.0000000,-0.1770000,0.9749896,NO,3.7000000929766E-7,
AEKAPAEKKPK,ac,K,28,false,"Histone deacetylases substrates - hda14 vs WT",98e,29061669,"MaxQuant Score",158.1000000,1.0000000,0.0510000,0.9440609,NO,4.600000014587E-29,
AEKAPAEKKPK,ac,K,28,false,"Quantitative Acetylproteomics",101,29440448,,,,,,,,
VAEKAPAEKK,ac,K,28,true,"Histone deacetylases- hda14 vs WT (low light)",98c,29061669,"MaxQuant Score",124.5100000,1.0000000,-2.5000000,0.9885531,NO,5.2000001460328E-7,
AEKAPAEKKPKAGKK,ac,K,33,false,"Quantitative Acetylproteomics",101,29440448,,,,,,,,
VAEKAPAEKKPK,ac,K,33,true,"Histone deacetylases - apicidin vs control",98a,29061669,"MaxQuant Score",95.5000000,1.0000000,0.9770000,0.0068707,YES,3.4999999343199E-7,
VAEKAPAEKKPK,ac,K,33,true,"Histone deacetylases substrates - TSA vs control",98b,29061669,"MaxQuant Score",95.5000000,1.0000000,3.7330000,0.0062517,YES,3.4999999343199E-7,
VAEKAPAEKKPK,ac,K,33,true,"Histone deacetylases- hda14 vs WT (low light)",98c,29061669,"MaxQuant Score",149.0700000,0.8800000,-2.3650000,0.9885531,NO,9.700000236357E-15,
VAEKAPAEKKPK,ac,K,33,true,"Histone deacetylases - hda14 vs WT (thylakoids)",98d,29061669,"MaxQuant Score",59.2000000,0.8490000,-0.1150000,0.9862795,NO,0.0010000000474975,
VAEKAPAEKKPK,ac,K,33,true,"Histone deacetylases substrates - hda14 vs WT",98e,29061669,"MaxQuant Score",94.1000000,1.0000000,-0.0010000,0.9954054,NO,6.5999998355437E-8,
VAEKAPAEKKPK,ac,K,33,true,"Quantitative Acetylproteomics",101,29440448,,,,,,,,
AEKAPAEKKPK,ac,K,33,false,"Histone deacetylases - apicidin vs control",98a,29061669,"MaxQuant Score",136.2000000,1.0000000,0.2090000,0.6011737,NO,5.4000000612784E-18,
AEKAPAEKKPK,ac,K,33,false,"Histone deacetylases substrates - TSA vs control",98b,29061669,"MaxQuant Score",136.2000000,1.0000000,3.9610000,0.0062517,YES,5.4000000612784E-18,
AEKAPAEKKPK,ac,K,33,false,"Histone deacetylases- hda14 vs WT (low light)",98c,29061669,"MaxQuant Score",174.5900000,0.8780000,-0.1270000,0.9885531,NO,2.6000000763471E-12,
AEKAPAEKKPK,ac,K,33,false,"Histone deacetylases - hda14 vs WT (thylakoids)",98d,29061669,"MaxQuant Score",120.9000000,0.8900000,-0.1770000,0.9749896,NO,3.7000000929766E-7,
AEKAPAEKKPK,ac,K,33,false,"Histone deacetylases substrates - hda14 vs WT",98e,29061669,"MaxQuant Score",158.1000000,1.0000000,0.0510000,0.9440609,NO,4.600000014587E-29,
AEKAPAEKKPK,ac,K,33,false,"Quantitative Acetylproteomics",101,29440448,,,,,,,,
VAEKAPAEKK,ac,K,33,true,"Histone deacetylases- hda14 vs WT (low light)",98c,29061669,"MaxQuant Score",124.5100000,1.0000000,-2.5000000,0.9885531,NO,5.2000001460328E-7,
VAEKAPAEKKPK,ac,K,34,true,"Histone deacetylases - apicidin vs control",98a,29061669,"MaxQuant Score",95.5000000,1.0000000,0.9770000,0.0068707,YES,3.4999999343199E-7,
VAEKAPAEKKPK,ac,K,34,true,"Histone deacetylases substrates - TSA vs control",98b,29061669,"MaxQuant Score",95.5000000,1.0000000,3.7330000,0.0062517,YES,3.4999999343199E-7,
VAEKAPAEKKPK,ac,K,34,true,"Histone deacetylases substrates - hda14 vs WT",98e,29061669,"MaxQuant Score",94.1000000,1.0000000,-0.0010000,0.9954054,NO,6.5999998355437E-8,
VAEKAPAEKKPK,ac,K,34,true,"Quantitative Acetylproteomics",101,29440448,,,,,,,,
AEKAPAEKKPK,ac,K,34,false,"Histone deacetylases - apicidin vs control",98a,29061669,"MaxQuant Score",136.2000000,1.0000000,0.2090000,0.6011737,NO,5.4000000612784E-18,
AEKAPAEKKPK,ac,K,34,false,"Histone deacetylases substrates - TSA vs control",98b,29061669,"MaxQuant Score",136.2000000,1.0000000,3.9610000,0.0062517,YES,5.4000000612784E-18,
AEKAPAEKKPK,ac,K,34,false,"Histone deacetylases substrates - hda14 vs WT",98e,29061669,"MaxQuant Score",158.1000000,1.0000000,0.0510000,0.9440609,NO,4.600000014587E-29,
AEKAPAEKKPK,ac,K,34,false,"Quantitative Acetylproteomics",101,29440448,,,,,,,,
AGKKLPK,ac,K,39,false,"Histone deacetylases- hda14 vs WT (low light)",98c,29061669,"MaxQuant Score",73.2600000,1.0000000,2.1740000,0.9885531,NO,0.046999998390675,
AGKKLPK,ac,K,39,false,"Histone deacetylases - hda14 vs WT (thylakoids)",98d,29061669,"MaxQuant Score",85.2000000,1.0000000,-0.0500000,0.9954054,NO,0.0080000003799796,
AGKKLPK,ac,K,39,false,"Quantitative Acetylproteomics",101,29440448,,,,,,,,
AEKAPAEKKPKAGKK,ac,K,40,false,"Quantitative Acetylproteomics",101,29440448,,,,,,,,
AGKKLPK,ac,K,40,false,"Histone deacetylases- hda14 vs WT (low light)",98c,29061669,"MaxQuant Score",73.2600000,1.0000000,2.1740000,0.9885531,NO,0.046999998390675,
AGKKLPK,ac,K,40,false,"Histone deacetylases - hda14 vs WT (thylakoids)",98d,29061669,"MaxQuant Score",85.2000000,1.0000000,-0.0500000,0.9954054,NO,0.0080000003799796,
AGKKLPK,ac,K,40,false,"Quantitative Acetylproteomics",101,29440448,,,,,,,,
IYIFKVLK,ac,K,70,false,"Quantitative Acetylproteomics",101,29440448,,,,,,,,
VLKQVHPDIGISSK,ac,K,73,false,"Histone deacetylases - hda14 vs WT (thylakoids)",98d,29061669,"MaxQuant Score",50.9000000,1.0000000,0.6080000,0.8394600,NO,0.00059100001817569,
VLKQVHPDIGISSK,hib,K,73,false,"Histone Khib and acetylation, dark-induced starvat",137,34165567,,,1.0000000,,,,,
VLKQVHPDIGISSK,ub,K,73,false,"upl3 mutant / wildtype",168,35926874,"MaxQuant score",125.2200000,1.0000000,1.2892443,0.1578840,NO,1.7604800461868E-7,0.4522500
QVHPDIGISSK,ph,S,83,false,"atm and atr DNA damage response",88,25561503,"MASCOT Score",32.0000000,0.9950000,,,,,-0.6200000
QVHPDIGISSK,ph,S,83,false,"Tissue atlas Arabidopsis - ProteomicsDB",114,32188942,"MaxQuant score",116.0600000,0.8773470,,,,2.8762500733137E-5,
LAQEASKLAR,ub,K,106,false,"upl3 mutant / wildtype",168,35926874,"MaxQuant score",54.2590000,1.0000000,0.5129853,,,0.012915999628603,0.0516260
YNKKPTITSR,hib,K,112,false,"Histone Khib and acetylation, dark-induced starvat",137,34165567,,,0.9963720,,,,,
YNKKPTITSR,ub,K,112,false,"Arabidopsis ubiquitination COFRADIC",40,26744219,"MaxQuant Score",110.5400000,1.0000000,,,,3.7299998894014E-6,0.9450000
KPTITSR,hib,K,113,false,"Histone Khib and acetylation, dark-induced starvat",137,34165567,,,1.0000000,,,,,
YNKKPTITSR,ub,K,113,false,"Arabidopsis ubiquitination COFRADIC",40,26744219,"MaxQuant Score",110.5400000,1.0000000,,,,3.7299998894014E-6,0.9450000
KPTITSREIQTAVR,ph,S,118,false,"atm and atr DNA damage response",88,25561503,"MASCOT Score",30.0000000,0.9340000,,,,,0.0100000
LVLPGELAKHAVSEGTKAVTK,nt,L,127,false,"Arabidopsis translation initiation landscape - NT",167b,35069635,,,,,,,,
LVLPGELAKHAVSEGTK,ac,K,135,false,"Histone deacetylases - apicidin vs control",98a,29061669,"MaxQuant Score",124.3000000,1.0000000,-0.0750000,0.7345139,NO,8.2999996171796E-15,
LVLPGELAKHAVSEGTK,ac,K,135,false,"Histone deacetylases- hda14 vs WT (low light)",98c,29061669,"MaxQuant Score",108.1400000,1.0000000,0.0950000,0.9931160,NO,1.2999999853491E-5,
LVLPGELAKHAVSEGTK,ac,K,135,false,"Histone deacetylases - hda14 vs WT (thylakoids)",98d,29061669,"MaxQuant Score",102.9000000,1.0000000,0.1910000,0.9571941,NO,5.5200000820266E-11,
LVLPGELAKHAVSEGTK,ac,K,135,false,"Histone deacetylases substrates - hda14 vs WT",98e,29061669,"MaxQuant Score",63.7000000,1.0000000,0.0650000,0.9289664,NO,6.7000000854023E-5,
LVLPGELAKHAVSEGTK,ac,K,135,false,"Quantitative Acetylproteomics",101,29440448,,,,,,,,
LVLPGELAKHAVSEGTK,hib,K,135,false,"Histone Khib and acetylation, dark-induced starvat",137,34165567,,,1.0000000,,,,,
LVLPGELAKHAVSEGTK,hib,K,135,false,"Open search Plant PTM Viewer 2.0 - hib",164e,TBA,,,,,,,,
LVLPGELAKHAVSEGTK,ub,K,135,false,"upl3 mutant / wildtype",168,35926874,"MaxQuant score",98.0620000,1.0000000,1.3487990,0.1497420,NO,7.3625000140964E-7,0.0573550
VSEGTKAVTKFTSS,nt,V,138,false,"Arabidopsis translation initiation landscape - NT",167b,35069635,,,,,,,,
HAVSEGTKAVTK,hib,K,143,false,"Histone Khib and acetylation, dark-induced starvat",137,34165567,,,1.0000000,,,,,
HAVSEGTKAVTK,sumo,K,143,false,"SUMO Ligase SIZ1 heat stress",4,29588388,,,,,,,,
HAVSEGTKAVTK,ub,K,143,false,"Ubiquitination Membrane Proteins",120,33585938,,,,,,,,
AVTKFTSS,ub,K,147,false,"Ubiquitination Membrane Proteins",120,33585938,,,,,,,,
AVTKFTSS,ub,K,147,false,"upl3 mutant / wildtype",168,35926874,"MaxQuant score",72.7890000,1.0000000,-0.9517638,0.3508800,NO,0.034909099340439,0.9045000
AVTKFTS,ub,K,147,false,"Ubiquitination Membrane Proteins",120,33585938,,,,,,,,
