Peptide,PTM,ModifiedAA,ModifiedPosition,PeptideUniqueToGene,ExperimentDesc,ExpID,PubmedID,ScoreType,IdentScore,LocProb,Log2FChange,PQ-val,QuantSig,PEP,MassErrorPPM
TSSSHNIELEAAKF,nta,T,2,true,"Arg/N-end rule pathway Roots",80,25728785,"MASCOT Score",62.6500000,,,,,1.5790000134075E-6,
TSSSHNIELEAAK,ph,S,3,true,"Tissue atlas Arabidopsis - ProteomicsDB",114,32188942,"MaxQuant score",199.3300000,0.8567750,,,,1.3655799799553E-25,
SSCLPHPGGTQTEDSGSAHLAGSSQAVGVSNEGK,ph,S,89,true,"Tissue atlas Arabidopsis - ProteomicsDB",114,32188942,"MaxQuant score",328.0500000,0.9997450,,,,0,
SSCLPHPGGTQTEDSGSAHLAGSSQAVGVSNEGK,ph,S,91,true,"Tissue atlas Arabidopsis - ProteomicsDB",114,32188942,"MaxQuant score",280.2100000,0.9999650,,,,0,
QLGGSNSASQTFYQGSGTQSNR,ph,S,131,true,"Tissue atlas Arabidopsis - ProteomicsDB",114,32188942,"MaxQuant score",169.4900000,0.9998230,,,,2.1019476964872E-44,
QLGGSNSASQTFYQGSGTQSNR,ph,S,133,true,"Tissue atlas Arabidopsis - ProteomicsDB",114,32188942,"MaxQuant score",475.4000000,0.9999990,,,,0,
QLGGSNSASQTFYQGSGTQSNR,ph,S,135,true,"Tissue atlas Arabidopsis - ProteomicsDB",114,32188942,"MaxQuant score",318.9000000,0.9999570,,,,0,
SFDRESPSNLDSTSGISQPHNR,ph,S,149,true,"srk2dei ABA signaling phopshoproteomics",83,23572148,"MASCOT Score",65.0000000,,,,,,0.0026000
SFDRESPSNLDSTSGISQPHNR,ph,S,149,true,"TOR Kinase and ABA Receptor",100,29290610,XCorr,5.8653903,0.9079000,,,,4.4509999852504E-11,
SFDRESPSNLDSTSGISQPHNR,ph,S,149,true,"Col-0 callus - FC Col-0 vs. Col-0 Xray",111a,31410901,,43.4600000,,0.4515486,0.0000000,NO,,1.2998902
SFDRESPSNLDSTSGISQPHNR,ph,S,149,true,"Col-0 X-ray callus - FC Col-0 vs. Col-0 Xray",111b,31410901,,43.4600000,,0.4515486,0.0000000,NO,,1.2998902
SFDRESPSNLDSTSGISQPHNR,ph,S,149,true,"atm callus - FC atm vs. atm Xray",111c,31410901,,43.4600000,,0.7976016,0.0000000,NO,,1.2998902
SFDRESPSNLDSTSGISQPHNR,ph,S,149,true,"atm-3 X-ray callus - FC atm vs. atm Xray",111d,31410901,,43.4600000,,0.7976016,0.0000000,NO,,1.2998902
SFDRESPSNLDSTSGISQPHNR,ph,S,149,true,"Tissue atlas Arabidopsis - ProteomicsDB",114,32188942,"MaxQuant score",198.4400000,0.9999990,,,,0,
SFDRESPSNLDSTSGISQPHNR,ph,S,154,true,"PAMP-triggered phosphorylation",48,24601666,"MASCOT Score",38.8100000,,,,,,
SFDRESPSNLDSTSGISQPHNR,ph,S,154,true,"srk2dei ABA signaling phopshoproteomics",83,23572148,"MASCOT Score",53.0000000,,,,,,-0.0014000
SFDRESPSNLDSTSGISQPHNR,ph,S,154,true,"atm and atr DNA damage response",88,25561503,"MASCOT Score",66.0000000,0.9930000,,,,,-0.3700000
SFDRESPSNLDSTSGISQPHNR,ph,S,154,true,"Phospho cell culture sucrose/TOR",109,30833711,,,0.9830410,,,,,
SFDRESPSNLDSTSGISQPHNR,ph,S,154,true,"Col-0 callus - FC Col-0 vs. Col-0 Xray",111a,31410901,,43.4600000,,0.4515486,0.0000000,NO,,1.2998902
SFDRESPSNLDSTSGISQPHNR,ph,S,154,true,"Col-0 X-ray callus - FC Col-0 vs. Col-0 Xray",111b,31410901,,43.4600000,,0.4515486,0.0000000,NO,,1.2998902
SFDRESPSNLDSTSGISQPHNR,ph,S,154,true,"atm callus - FC atm vs. atm Xray",111c,31410901,,43.4600000,,0.7976016,0.0000000,NO,,1.2998902
SFDRESPSNLDSTSGISQPHNR,ph,S,154,true,"atm-3 X-ray callus - FC atm vs. atm Xray",111d,31410901,,43.4600000,,0.7976016,0.0000000,NO,,1.2998902
SFDRESPSNLDSTSGISQPHNR,ph,S,154,true,"Tissue atlas Arabidopsis - ProteomicsDB",114,32188942,"MaxQuant score",300.2700000,0.9987010,,,,0,
SFDRESPSNLDSTSGISQPHNR,ph,S,156,true,"PAMP-triggered phosphorylation",48,24601666,"MASCOT Score",44.1700000,,,,,,
SFDRESPSNLDSTSGISQPHNR,ph,S,156,true,"srk2dei ABA signaling phopshoproteomics",83,23572148,"MASCOT Score",71.0000000,,,,,,-0.0021000
SFDRESPSNLDSTSGISQPHNR,ph,S,156,true,"SnRK2 protein kinase substrates",85,23776212,XCorr,4.8609571,0.9900000,,,,1.2896899694026E-11,
SFDRESPSNLDSTSGISQPHNR,ph,S,156,true,"Col-0 callus - FC Col-0 vs. Col-0 Xray",111a,31410901,,54.6900000,,0.1622480,0.0000000,NO,,1.1298585
SFDRESPSNLDSTSGISQPHNR,ph,S,156,true,"Col-0 X-ray callus - FC Col-0 vs. Col-0 Xray",111b,31410901,,54.6900000,,0.1622480,0.0000000,NO,,1.1298585
SFDRESPSNLDSTSGISQPHNR,ph,S,156,true,"atm callus - FC atm vs. atm Xray",111c,31410901,,54.6900000,,0.5897409,0.0000000,NO,,1.1298585
SFDRESPSNLDSTSGISQPHNR,ph,S,156,true,"atm-3 X-ray callus - FC atm vs. atm Xray",111d,31410901,,54.6900000,,0.5897409,0.0000000,NO,,1.1298585
ESPSNLDSTSGISQPHNR,ph,S,156,true,"Tissue atlas Arabidopsis - ProteomicsDB",114,32188942,"MaxQuant score",104.8800000,0.9724540,,,,4.5965902195633E-9,
SFDRESPSNLDSTSGISQPHNR,ph,S,160,true,"Tissue atlas Arabidopsis - ProteomicsDB",114,32188942,"MaxQuant score",181.7800000,0.8057840,,,,0,
ESPSNLDSTSGISQPHNR,ph,T,161,true,"Tissue atlas Arabidopsis - ProteomicsDB",114,32188942,"MaxQuant score",145.7700000,0.7751300,,,,1.9939400423828E-17,
SFDRESPSNLDSTSGISQPHNR,ph,S,162,true,"Tissue atlas Arabidopsis - ProteomicsDB",114,32188942,"MaxQuant score",102.7200000,0.8044990,,,,5.5507000905342E-12,
ESPSNLDSTSGISQPHNR,ph,S,165,true,"Tissue atlas Arabidopsis - ProteomicsDB",114,32188942,"MaxQuant score",88.3290000,0.9983020,,,,1.8148699382436E-5,
RGESSLSWDQNMDNSQIFDSHK,ph,S,193,true,"Phospho cell culture sucrose/TOR",109,30833711,,,0.9400400,,,,,
GESSLSWDQNMDNSQIFDSHK,ph,S,193,true,"Tissue atlas Arabidopsis - ProteomicsDB",114,32188942,"MaxQuant score",270.1800000,0.9938780,,,,0,
IEMPGNSGDIR,ph,S,225,true,"Tissue atlas Arabidopsis - ProteomicsDB",114,32188942,"MaxQuant score",110.9800000,1.0000000,,,,3.3242300560232E-5,
LDEMDFSSKETER,ub,K,367,true,"Arabidopsis ubiquitination COFRADIC",40,26744219,"MaxQuant Score",64.1040000,1.0000000,,,,0.00023479999799747,-0.0340000
LGEKSFANTVFSDGQK,ac,K,377,true,"Histone deacetylases - apicidin vs control",98a,29061669,"MaxQuant Score",125.7000000,1.0000000,1.8030000,0.0004426,YES,1.2999999941278E-14,
LGEKSFANTVFSDGQK,ac,K,377,true,"Histone deacetylases substrates - TSA vs control",98b,29061669,"MaxQuant Score",125.7000000,1.0000000,2.8450000,0.1811340,NO,1.2999999941278E-14,
LGEKSFANTVFSDGQK,ac,K,377,true,"Histone deacetylases substrates - hda14 vs WT",98e,29061669,"MaxQuant Score",67.7000000,1.0000000,-0.1360000,0.9120108,NO,1.9999999949505E-6,
LLASRIPSSQAQTQVAVSHSQLTFSPGLTK,og,S,398,true,"O-GlcNac Inflorescence Tissue",81,28154133,"MASCOT Score",34.2000000,,,,,,2.2000000
IPSSQAQTQVAVSHSQLTFSPGLTK,og,T,402,true,"O-GlcNac Inflorescence Tissue",81,28154133,"MASCOT Score",25.6000000,,,,,,1.1000000
IPSSQAQTQVAVSHSQLTFSPGLTK,og,S,407,true,"O-GlcNac Inflorescence Tissue",81,28154133,"MASCOT Score",31.4000000,,,,,,0.9400000
IPSSQAQTQVAVSHSQLTFSPGLTK,ph,S,414,true,"Tissue atlas Arabidopsis - ProteomicsDB",114,32188942,"MaxQuant score",154.5800000,0.9203880,,,,0,
TNDLSTSAVQLDEFHSSDEEEGNLQPSPK,ph,T,434,true,"Lateral root-induction - NAA vs control",106,23328941,"MASCOT Score",25.0000000,,,,,,
TNDLSTSAVQLDEFHSSDEEEGNLQPSPK,ph,S,438,true,"Lateral root-induction - NAA vs control",106,23328941,"MASCOT Score",22.0000000,,,,,,
TNDLSTSAVQLDEFHSSDEEEGNLQPSPK,ph,S,449,true,"srk2dei ABA signaling phopshoproteomics",83,23572148,"MASCOT Score",67.0000000,,,,,,-0.0007000
TNDLSTSAVQLDEFHSSDEEEGNLQPSPK,ph,S,449,true,"SnRK2 protein kinase substrates",85,23776212,XCorr,3.4693346,0.9990000,,,,0.0032117199152708,
TNDLSTSAVQLDEFHSSDEEEGNLQPSPK,ph,S,449,true,"Brassinosteroid-Regulated Phosphorylation Dynamics",94,26187819,"MaxQuant Score",135.6900000,1.0000000,,,,1.2740000048067E-17,-0.7390000
TNDLSTSAVQLDEFHSSDEEEGNLQPSPK,ph,S,449,true,"TOR Kinase and ABA Receptor",100,29290610,XCorr,5.6221895,0.9973000,,,,9.5780001174717E-7,
TNDLSTSAVQLDEFHSSDEEEGNLQPSPK,ph,S,449,true,"Lateral root-induction - NAA vs control",106,23328941,"MASCOT Score",37.0000000,,,,,,
TNDLSTSAVQLDEFHSSDEEEGNLQPSPK,ph,S,449,true,"Phospho cell culture sucrose/TOR",109,30833711,,,0.9999950,,,,,
TNDLSTSAVQLDEFHSSDEEEGNLQPSPK,ph,S,449,true,"Col-0 callus - FC Col-0 vs. Col-0 Xray",111a,31410901,,46.6100000,,0.9610532,0.0295161,YES,,1.2239461
TNDLSTSAVQLDEFHSSDEEEGNLQPSPK,ph,S,449,true,"Col-0 X-ray callus - FC Col-0 vs. Col-0 Xray",111b,31410901,,46.6100000,,0.9610532,0.0295161,YES,,1.2239461
TNDLSTSAVQLDEFHSSDEEEGNLQPSPK,ph,S,449,true,"atm callus - FC atm vs. atm Xray",111c,31410901,,46.6100000,,1.3375178,0.0274128,YES,,1.2239461
TNDLSTSAVQLDEFHSSDEEEGNLQPSPK,ph,S,449,true,"atm-3 X-ray callus - FC atm vs. atm Xray",111d,31410901,,46.6100000,,1.3375178,0.0274128,YES,,1.2239461
TNDLSTSAVQLDEFHSSDEEEGNLQPSPK,ph,S,449,true,"Tissue atlas Arabidopsis - ProteomicsDB",114,32188942,"MaxQuant score",318.9900000,1.0000000,,,,0,
TNDLSTSAVQLDEFHSSDEEEGNLQPSPK,ph,S,450,true,"srk2dei ABA signaling phopshoproteomics",83,23572148,"MASCOT Score",67.0000000,,,,,,-0.0007000
TNDLSTSAVQLDEFHSSDEEEGNLQPSPK,ph,S,450,true,"SnRK2 protein kinase substrates",85,23776212,XCorr,3.4693346,0.9990000,,,,0.0032117199152708,
TNDLSTSAVQLDEFHSSDEEEGNLQPSPK,ph,S,450,true,"Brassinosteroid-Regulated Phosphorylation Dynamics",94,26187819,"MaxQuant Score",135.6900000,1.0000000,,,,1.2740000048067E-17,-0.7390000
TNDLSTSAVQLDEFHSSDEEEGNLQPSPK,ph,S,450,true,"TOR Kinase and ABA Receptor",100,29290610,XCorr,5.6221895,0.9994000,,,,9.5780001174717E-7,
TNDLSTSAVQLDEFHSSDEEEGNLQPSPK,ph,S,450,true,"Lateral root-induction - NAA vs control",106,23328941,"MASCOT Score",37.0000000,,,,,,
TNDLSTSAVQLDEFHSSDEEEGNLQPSPK,ph,S,450,true,"Col-0 callus - FC Col-0 vs. Col-0 Xray",111a,31410901,,46.6100000,,0.9610532,0.0295161,YES,,1.2239461
TNDLSTSAVQLDEFHSSDEEEGNLQPSPK,ph,S,450,true,"Col-0 X-ray callus - FC Col-0 vs. Col-0 Xray",111b,31410901,,46.6100000,,0.9610532,0.0295161,YES,,1.2239461
TNDLSTSAVQLDEFHSSDEEEGNLQPSPK,ph,S,450,true,"atm callus - FC atm vs. atm Xray",111c,31410901,,46.6100000,,1.3375178,0.0274128,YES,,1.2239461
TNDLSTSAVQLDEFHSSDEEEGNLQPSPK,ph,S,450,true,"atm-3 X-ray callus - FC atm vs. atm Xray",111d,31410901,,46.6100000,,1.3375178,0.0274128,YES,,1.2239461
TNDLSTSAVQLDEFHSSDEEEGNLQPSPK,ph,S,450,true,"Tissue atlas Arabidopsis - ProteomicsDB",114,32188942,"MaxQuant score",318.9900000,1.0000000,,,,0,
TSNATDDETLIENEDESDQAK,ph,T,706,true,"Tissue atlas Arabidopsis - ProteomicsDB",114,32188942,"MaxQuant score",301.5100000,0.9995530,,,,0,
TSNATDDETLIENEDESDQAK,ph,S,718,true,"Tissue atlas Arabidopsis - ProteomicsDB",114,32188942,"MaxQuant score",195.1300000,1.0000000,,,,0,
RVEDNLGSIGNAKSR,ac,K,1028,true,"Quantitative Acetylproteomics",101,29440448,,,,,,,,
RESEIDIFESIDK,ph,S,1270,true,"Tissue atlas Arabidopsis - ProteomicsDB",114,32188942,"MaxQuant score",107.3400000,1.0000000,,,,0.00011660699965432,
DGSMGGLDTHQYGR,ph,S,1347,true,"atm and atr DNA damage response",88,25561503,"MASCOT Score",50.0000000,1.0000000,,,,,0.3400000
DGSMGGLDTHQYGR,ph,S,1347,true,"Tissue atlas Arabidopsis - ProteomicsDB",114,32188942,"MaxQuant score",153.5800000,1.0000000,,,,2.2516499775804E-10,
LCQTESPDSPQGK,ph,S,1385,true,"atm and atr DNA damage response",88,25561503,"MASCOT Score",47.0000000,1.0000000,,,,,-1.0400000
LCQTESPDSPQGK,ph,S,1385,true,"Lateral root-induction - NAA vs control",106,23328941,"MASCOT Score",36.0000000,,,,,,
LCQTESPDSPQGK,ph,S,1385,true,"Tissue atlas Arabidopsis - ProteomicsDB",114,32188942,"MaxQuant score",228.8000000,1.0000000,,,,0,
LCQTESPDSPQGK,ph,S,1388,true,"STN8 phosphoproteome",38,21768351,"MASCOT Score",46.9400000,,,,,,
LCQTESPDSPQGK,ph,S,1388,true,"Chloroplast kinase substrates",60,19376835,"MASCOT Score",35.3800000,,,,,,-1.3985000
LCQTESPDSPQGK,ph,S,1388,true,"SnRK2 protein kinase substrates",85,23776212,XCorr,3.0982373,1.0000000,,,,7.5947296863887E-5,
LCQTESPDSPQGK,ph,S,1388,true,"atm and atr DNA damage response",88,25561503,"MASCOT Score",54.0000000,1.0000000,,,,,-0.2600000
LCQTESPDSPQGK,ph,S,1388,true,"TOR Kinase and ABA Receptor",100,29290610,XCorr,4.0776324,0.9897000,,,,3.3609999263717E-6,
LCQTESPDSPQGK,ph,S,1388,true,"Lateral root-induction - NAA vs control",106,23328941,"MASCOT Score",47.0000000,,,,,,
LCQTESPDSPQGK,ph,S,1388,true,"Phospho cell culture sucrose/TOR",109,30833711,,,0.9985140,,,,,
LCQTESPDSPQGK,ph,S,1388,true,"Col-0 callus - FC Col-0 vs. Col-0 Xray",111a,31410901,,54.2400000,,0.9038594,0.0000000,NO,,0.4230931
LCQTESPDSPQGK,ph,S,1388,true,"Col-0 X-ray callus - FC Col-0 vs. Col-0 Xray",111b,31410901,,54.2400000,,0.9038594,0.0000000,NO,,0.4230931
LCQTESPDSPQGK,ph,S,1388,true,"atm callus - FC atm vs. atm Xray",111c,31410901,,54.2400000,,1.5182827,0.0000000,NO,,0.4230931
LCQTESPDSPQGK,ph,S,1388,true,"atm-3 X-ray callus - FC atm vs. atm Xray",111d,31410901,,54.2400000,,1.5182827,0.0000000,NO,,0.4230931
LCQTESPDSPQGK,ph,S,1388,true,"Tissue atlas Arabidopsis - ProteomicsDB",114,32188942,"MaxQuant score",293.8800000,1.0000000,,,,0,
SLANDTSNIPVENSSDTLLPTSPTQAITVQPMEPVRPQSHTLK,ph,T,1426,true,"TOR Kinase and ABA Receptor",100,29290610,XCorr,5.0673337,0.8821000,,,,0.00014910000027157,
ALTPVSLSAVSR,ph,T,1462,true,"Tissue atlas Arabidopsis - ProteomicsDB",114,32188942,"MaxQuant score",151.6600000,0.9999990,,,,9.8774103207688E-7,
RVEGVLHGSNSSITQR,ph,S,1558,true,"Tissue atlas Arabidopsis - ProteomicsDB",114,32188942,"MaxQuant score",103.2500000,0.9155810,,,,7.0975102062221E-7,
TETATSLASDAEATK,ph,S,1569,true,"Tissue atlas Arabidopsis - ProteomicsDB",114,32188942,"MaxQuant score",115.2600000,0.9824020,,,,4.4165999497636E-6,
TETATSLASDAEATK,ph,S,1572,true,"Tissue atlas Arabidopsis - ProteomicsDB",114,32188942,"MaxQuant score",124.6800000,0.9743510,,,,2.7942999167863E-6,
SASEIVSR,ph,S,1586,true,"atm and atr DNA damage response",88,25561503,"MASCOT Score",66.0000000,1.0000000,,,,,-1.2400000
SASEIVSR,ph,S,1586,true,"TOR Kinase and ABA Receptor",100,29290610,XCorr,3.1886401,0.9968000,,,,0.00088890001643449,
SASEIVSR,ph,S,1586,true,"Phospho cell culture sucrose/TOR",109,30833711,,,0.9992680,,,,,
SASEIVSR,ph,S,1586,true,"Tissue atlas Arabidopsis - ProteomicsDB",114,32188942,"MaxQuant score",115.7800000,0.9999990,,,,0.0032264599576592,
ANEGSTSNPDQVSPVHSATTALR,ph,S,1601,true,"Tissue atlas Arabidopsis - ProteomicsDB",114,32188942,"MaxQuant score",145.1900000,0.9650020,,,,5.0396900426182E-34,
ANEGSTSNPDQVSPVHSATTALR,ph,S,1607,true,"srk2dei ABA signaling phopshoproteomics",83,23572148,"MASCOT Score",88.0000000,,,,,,0.0010000
ANEGSTSNPDQVSPVHSATTALR,ph,S,1607,true,"SnRK2 protein kinase substrates",85,23776212,XCorr,3.0615799,0.7760000,,,,0.011471600271761,
ANEGSTSNPDQVSPVHSATTALR,ph,S,1607,true,"TOR Kinase and ABA Receptor",100,29290610,XCorr,5.0681272,0.8661000,,,,3.9130000004661E-6,
ANEGSTSNPDQVSPVHSATTALR,ph,S,1607,true,"Lateral root-induction - NAA vs control",106,23328941,"MASCOT Score",34.0000000,,0.0167618,0.9845280,NO,,
ANEGSTSNPDQVSPVHSATTALR,ph,S,1607,true,"Phospho cell culture sucrose/TOR",109,30833711,,,0.9973960,,,,,
ANEGSTSNPDQVSPVHSATTALR,ph,S,1607,true,"Col-0 callus - FC Col-0 vs. Col-0 Xray",111a,31410901,,53.1700000,,0.1039632,0.0000000,NO,,1.2201987
ANEGSTSNPDQVSPVHSATTALR,ph,S,1607,true,"Col-0 X-ray callus - FC Col-0 vs. Col-0 Xray",111b,31410901,,53.1700000,,0.1039632,0.0000000,NO,,1.2201987
ANEGSTSNPDQVSPVHSATTALR,ph,S,1607,true,"atm callus - FC atm vs. atm Xray",111c,31410901,,53.1700000,,0.2332342,0.0000000,NO,,1.2201987
ANEGSTSNPDQVSPVHSATTALR,ph,S,1607,true,"atm-3 X-ray callus - FC atm vs. atm Xray",111d,31410901,,53.1700000,,0.2332342,0.0000000,NO,,1.2201987
ANEGSTSNPDQVSPVHSATTALR,ph,S,1607,true,"Tissue atlas Arabidopsis - ProteomicsDB",114,32188942,"MaxQuant score",405.0300000,1.0000000,,,,0,
ANEGSTSNPDQVSPVHSATTALR,ph,S,1611,true,"Tissue atlas Arabidopsis - ProteomicsDB",114,32188942,"MaxQuant score",103.1500000,0.9505910,,,,7.805510252902E-13,
DLDAPPGFDSGSHVQTLNVLENSSER,ph,S,1647,true,"Tissue atlas Arabidopsis - ProteomicsDB",114,32188942,"MaxQuant score",119.9600000,0.8187520,,,,2.0531099383628E-34,
NLPSRGETPKR,ph,S,1776,true,"Tissue atlas Arabidopsis - ProteomicsDB",114,32188942,"MaxQuant score",50.0880000,0.7828880,,,,0.0096293203532696,
NLPSRGETPKR,ph,T,1780,true,"Tissue atlas Arabidopsis - ProteomicsDB",114,32188942,"MaxQuant score",73.3860000,0.9892340,,,,0.0012735800119117,
RGQPLPATDASSAR,me1,R,1788,true,"Arabidopsis protein methylome",123,31809900,"MaxQuant Score",138.1900000,1.0000000,,,,0,0.0341780
KQTADVTDVAR,ub,K,1864,true,"Arabidopsis ubiquitination COFRADIC",40,26744219,"MaxQuant Score",119.9400000,1.0000000,,,,1.1930000173507E-12,-0.2490000
TNVPDAQSPGEMNLHTVETHK,ph,S,1906,true,"Arabidopsis root NAA phosphoproteome",18a,27643528,"MaxQuant Score",59.3590000,0.9940000,,,,1.4049999663257E-5,-0.2940000
TNVPDAQSPGEMNLHTVETHK,ph,S,1906,true,"srk2dei ABA signaling phopshoproteomics",83,23572148,"MASCOT Score",40.0000000,,,,,,-0.0006000
TNVPDAQSPGEMNLHTVETHK,ph,S,1906,true,"SnRK2 protein kinase substrates",85,23776212,XCorr,2.9044621,0.9980000,,,,0.0013256600359455,
TNVPDAQSPGEMNLHTVETHK,ph,S,1906,true,"atm and atr DNA damage response",88,25561503,"MASCOT Score",51.0000000,1.0000000,,,,,-0.3600000
TNVPDAQSPGEMNLHTVETHK,ph,S,1906,true,"TOR Kinase and ABA Receptor",100,29290610,XCorr,3.2967887,1.0000000,,,,2.9540000468842E-5,
TNVPDAQSPGEMNLHTVETHK,ph,S,1906,true,"Phospho cell culture sucrose/TOR",109,30833711,,,0.9999990,,,,,
TNVPDAQSPGEMNLHTVETHK,ph,S,1906,true,"Tissue atlas Arabidopsis - ProteomicsDB",114,32188942,"MaxQuant score",288.3100000,1.0000000,,,,0,
CTADQLLGEK,ph,T,2008,true,"Phosphorylation Early Elicitor Signaling",23,17317660,,,,,,,,
LSQEGETTPASDGETCHLAEETASSLSYVR,ph,T,2023,true,"Lateral root-induction - NAA vs control",106,23328941,"MASCOT Score",21.0000000,,,,,,
LSQEGETTPASDGETCHLAEETASSLSYVR,ph,T,2024,true,"srk2dei ABA signaling phopshoproteomics",83,23572148,"MASCOT Score",43.0000000,,,,,,-0.0029000
LSQEGETTPASDGETCHLAEETASSLSYVR,ph,T,2024,true,"SnRK2 protein kinase substrates",85,23776212,XCorr,3.6664343,0.8530000,,,,0.0070718200877309,
LSQEGETTPASDGETCHLAEETASSLSYVR,ph,T,2024,true,"Tissue atlas Arabidopsis - ProteomicsDB",114,32188942,"MaxQuant score",151.3600000,0.9921000,,,,0,
LSQEGETTPASDGETCHLAEETASSLSYVR,ph,S,2027,true,"srk2dei ABA signaling phopshoproteomics",83,23572148,"MASCOT Score",43.0000000,,,,,,-0.0029000
LSQEGETTPASDGETCHLAEETASSLSYVR,ph,S,2027,true,"SnRK2 protein kinase substrates",85,23776212,XCorr,3.6664343,0.7650000,,,,0.0070718200877309,
LSQEGETTPASDGETCHLAEETASSLSYVR,ph,S,2027,true,"TOR Kinase and ABA Receptor",100,29290610,XCorr,4.5019832,0.8489000,,,,6.4330001805502E-6,
LSQEGETTPASDGETCHLAEETASSLSYVR,ph,S,2027,true,"Lateral root-induction - NAA vs control",106,23328941,"MASCOT Score",43.0000000,,,,,,
LSQEGETTPASDGETCHLAEETASSLSYVR,ph,S,2027,true,"Col-0 callus - FC Col-0 vs. Col-0 Xray",111a,31410901,,48.4900000,,1.2090174,0.0000000,NO,,0.9594226
LSQEGETTPASDGETCHLAEETASSLSYVR,ph,S,2027,true,"Col-0 X-ray callus - FC Col-0 vs. Col-0 Xray",111b,31410901,,48.4900000,,1.2090174,0.0000000,NO,,0.9594226
LSQEGETTPASDGETCHLAEETASSLSYVR,ph,S,2027,true,"atm callus - FC atm vs. atm Xray",111c,31410901,,48.4900000,,1.4527257,0.0000000,NO,,0.9594226
LSQEGETTPASDGETCHLAEETASSLSYVR,ph,S,2027,true,"atm-3 X-ray callus - FC atm vs. atm Xray",111d,31410901,,48.4900000,,1.4527257,0.0000000,NO,,0.9594226
LSQEGETTPASDGETCHLAEETASSLSYVR,ph,S,2027,true,"Tissue atlas Arabidopsis - ProteomicsDB",114,32188942,"MaxQuant score",273.6300000,0.9981970,,,,0,
SEPTASASTTAEPLPTDKLEK,ph,T,2050,true,"Tissue atlas Arabidopsis - ProteomicsDB",114,32188942,"MaxQuant score",77.0800000,0.7653850,,,,7.250649650814E-5,
SEPTASASTTAEPLPTDKLEK,ph,S,2052,true,"Tissue atlas Arabidopsis - ProteomicsDB",114,32188942,"MaxQuant score",144.2700000,0.9992740,,,,1.3749899812189E-24,
NISFQDEVK,ph,S,2070,true,"srk2dei ABA signaling phopshoproteomics",83,23572148,"MASCOT Score",25.0000000,,,,,,0.0011000
NISFQDEVK,ph,S,2070,true,"atm and atr DNA damage response",88,25561503,"MASCOT Score",57.0000000,1.0000000,,,,,-2.2400000
NISFQDEVK,ph,S,2070,true,"Tissue atlas Arabidopsis - ProteomicsDB",114,32188942,"MaxQuant score",158.5600000,1.0000000,,,,8.2453901995905E-5,
EAILLSSEEQTNVNSK,ph,S,2090,true,"Tissue atlas Arabidopsis - ProteomicsDB",114,32188942,"MaxQuant score",156.0000000,0.9365880,,,,1.4420699335181E-13,
IETNSEELQASR,ph,T,2102,true,"Lateral root-induction - NAA vs control",106,23328941,"MASCOT Score",35.0000000,,,,,,
IETNSEELQASR,ph,S,2104,true,"atm and atr DNA damage response",88,25561503,"MASCOT Score",73.0000000,1.0000000,,,,,-0.3700000
IETNSEELQASR,ph,S,2104,true,"TOR Kinase and ABA Receptor",100,29290610,XCorr,3.0893266,0.9994000,,,,0.00025660000392236,
IETNSEELQASR,ph,S,2104,true,"Lateral root-induction - NAA vs control",106,23328941,"MASCOT Score",33.0000000,,,,,,
IETNSEELQASR,ph,S,2104,true,"Tissue atlas Arabidopsis - ProteomicsDB",114,32188942,"MaxQuant score",279.5500000,1.0000000,,,,0,
SVDVANQTVKEDEAK,ph,S,2122,true,"Tissue atlas Arabidopsis - ProteomicsDB",114,32188942,"MaxQuant score",220.9700000,1.0000000,,,,0,
SADIEQDPEESVFVQGVGRPK,ph,S,2190,true,"Tissue atlas Arabidopsis - ProteomicsDB",114,32188942,"MaxQuant score",214.1900000,1.0000000,,,,0,
LLVGCSVESEEKEK,ph,S,2234,true,"Tissue atlas Arabidopsis - ProteomicsDB",114,32188942,"MaxQuant score",241.1400000,1.0000000,,,,0,
VLVGCSVESEEKEK,ph,S,2408,true,"Tissue atlas Arabidopsis - ProteomicsDB",114,32188942,"MaxQuant score",130.3200000,0.9999200,,,,6.8098903284408E-5,
TLQSHIPGDDADTEQNPEESVSNFDRPK,ph,S,2433,true,"Tissue atlas Arabidopsis - ProteomicsDB",114,32188942,"MaxQuant score",85.2030000,0.8003570,,,,1.1244299906121E-15,
LLVGCSVESEEKEK,ph,S,2465,true,"Tissue atlas Arabidopsis - ProteomicsDB",114,32188942,"MaxQuant score",241.1400000,1.0000000,,,,0,
GFESETHAR,ph,S,2519,true,"Tissue atlas Arabidopsis - ProteomicsDB",114,32188942,"MaxQuant score",94.7910000,0.9935400,,,,0.00066386297112331,
TDSGGIDRGNEVSENMSDGVK,ph,S,2527,true,"TOR Kinase and ABA Receptor",100,29290610,XCorr,3.1205943,0.8872000,,,,0.0024399999529123,
TDSGGIDRGNEVSENMSDGVK,ph,S,2527,true,"Tissue atlas Arabidopsis - ProteomicsDB",114,32188942,"MaxQuant score",140.2100000,0.9999980,,,,3.025369923944E-23,
GNEVSENMSDGVK,ph,S,2541,true,"Tissue atlas Arabidopsis - ProteomicsDB",114,32188942,"MaxQuant score",92.4950000,0.9999500,,,,0.00010099999781232,
TNISSEQVPDVSHDLK,ph,S,2631,true,"Tissue atlas Arabidopsis - ProteomicsDB",114,32188942,"MaxQuant score",78.4000000,0.8848290,,,,9.1156696726102E-5,
TCQPSSSTQPEDENR,ox,C,2728,true,"OxiTRAQ Arabidopsis - 5 mM H2O2 versus control",47,24376095,,,,-0.1340747,0.4912600,NO,,
TCQPSSSTQPEDENR,ph,S,2731,true,"Lateral root-induction - NAA vs control",106,23328941,"MASCOT Score",28.0000000,,,,,,
TCQPSSSTQPEDENR,ph,S,2733,true,"Lateral root-induction - NAA vs control",106,23328941,"MASCOT Score",39.0000000,,,,,,
NSLSHCEPSEVVEQR,ph,S,2745,true,"Tissue atlas Arabidopsis - ProteomicsDB",114,32188942,"MaxQuant score",133.2400000,0.9969030,,,,4.2388899146317E-7,
NSLSHCEPSEVVEQR,ph,S,2750,true,"Tissue atlas Arabidopsis - ProteomicsDB",114,32188942,"MaxQuant score",89.3740000,0.9999970,,,,0.00011184500181116,
THLADVVPSSSPTTMEK,ph,S,3125,true,"Lateral root-induction - NAA vs control",106,23328941,"MASCOT Score",54.0000000,,-1.1015805,0.0000002,YES,,
THLADVVPSSSPTTMEK,ph,S,3126,true,"srk2dei ABA signaling phopshoproteomics",83,23572148,"MASCOT Score",29.0000000,,,,,,0.0005000
THLADVVPSSSPTTMEK,ph,S,3127,true,"srk2dei ABA signaling phopshoproteomics",83,23572148,"MASCOT Score",50.0000000,,,,,,0.0017000
THLADVVPSSSPTTMEK,ph,S,3127,true,"SnRK2 protein kinase substrates",85,23776212,XCorr,3.5456159,0.9460000,,,,0.0043151099234819,
THLADVVPSSSPTTMEK,ph,S,3127,true,"atm and atr DNA damage response",88,25561503,"MASCOT Score",47.0000000,0.9610000,,,,,0.4700000
THLADVVPSSSPTTMEK,ph,S,3127,true,"TOR Kinase and ABA Receptor",100,29290610,XCorr,5.6085763,0.9988000,,,,2.3160000583999E-9,
THLADVVPSSSPTTMEK,ph,S,3127,true,"Tissue atlas Arabidopsis - ProteomicsDB",114,32188942,"MaxQuant score",274.8100000,0.9965550,,,,0,
DHIETAECELVDVSPGCSSQPEVK,ph,S,3482,true,"STN8 phosphoproteome",38,21768351,"MASCOT Score",63.6900000,,,,,,
DHIETAECELVDVSPGCSSQPEVK,ph,S,3482,true,"SnRK2 protein kinase substrates",85,23776212,XCorr,4.1714883,0.9990000,,,,6.1590799305122E-7,
DHIETAECELVDVSPGCSSQPEVK,ph,S,3482,true,"Tissue atlas Arabidopsis - ProteomicsDB",114,32188942,"MaxQuant score",129.6400000,0.9998900,,,,3.4181500949482E-28,