Peptide,PTM,ModifiedAA,ModifiedPosition,PeptideUniqueToGene,ExperimentDesc,ExpID,PubmedID,ScoreType,IdentScore,LocProb,Log2FChange,PQ-val,QuantSig,PEP,MassErrorPPM
MDLDGPLDFENEDPLVNPPTIIEKR,nta,M,1,true,"Arabidopsis translation initiation landscape - NTA",167a,35069635,,,,,,,,
VYHSDDDEQGQVDK,ph,S,61,true,"Tyrosine phosphorylation in Arabidopsis",59,18463617,"MASCOT Score",21.0000000,,,,,,-0.2917746
VYHSDDDEQGQVDK,ph,S,61,true,"Conserved plant phosphoproteome - Arabidopsis",61a,20466843,"MASCOT Score",39.0000000,1.0000000,,,,,
VYHSDDDEQGQVDK,ph,S,61,true,"SnRK2 protein kinase substrates",85,23776212,XCorr,4.5149755,1.0000000,,,,7.1957401814871E-5,
VYHSDDDEQGQVDK,ph,S,61,true,"atm and atr DNA damage response",88,25561503,"MASCOT Score",56.0000000,1.0000000,,,,,-0.1600000
VYHSDDDEQGQVDK,ph,S,61,true,"TOR Kinase and ABA Receptor",100,29290610,XCorr,6.0733385,1.0000000,,,,5.9569997823417E-9,
VYHSDDDEQGQVDK,ph,S,61,true,"Phospho cell culture sucrose/TOR",109,30833711,,,0.9999940,,,,,
VYHSDDDEQGQVDK,ph,S,61,true,"Tissue atlas Arabidopsis - ProteomicsDB",114,32188942,"MaxQuant score",268.9300000,1.0000000,,,,0,
WTLNILLYSSKEDLR,ub,K,179,true,"Arabidopsis ubiquitination by TUBEs",2,23667124,,,,,,,,
WTLNILLYSSKEDLR,ub,K,179,true,"MudPIT plant ubiquitination",103,17272265,XCorr,2.6500000,,,,,,
