Peptide,PTM,ModifiedAA,ModifiedPosition,PeptideUniqueToGene,ExperimentDesc,ExpID,PubmedID,ScoreType,IdentScore,LocProb,Log2FChange,PQ-val,QuantSig,PEP,MassErrorPPM
ANPSIFNPTHLNASQWVQIAK,ng,N,82,true,"Conserved N-glycosylation",74,22633491,"MaxQuant Score",171.4700000,0.9960000,,,,0,1.7670000
NCLFLLNVPPNSSGLISEQDIK,ng,N,320,true,"Conserved N-glycosylation",74,22633491,"MaxQuant Score",205.9600000,1.0000000,,,,0,-0.4350000
VLEEFSEMK,ph,S,337,true,"Tissue atlas Arabidopsis - ProteomicsDB",114,32188942,"MaxQuant score",65.0380000,1.0000000,,,,0.0048572700470686,
KAFVNSSSIRGDQSSQFGPK,ng,N,355,true,"N-Glycopeptide Profiling in Arabidopsis Infloresce",132,27067053,"MOWSE score",38.1000000,,,,,0.00015999999595806,
AFVNSSSIRGDQSSQFGPK,ng,N,355,true,"N-Glycopeptide Profiling in Arabidopsis Infloresce",132,27067053,"MOWSE score",16.5000000,,,,,0.041000001132488,
KAFVNSSSIR,ng,N,355,true,"Conserved N-glycosylation",74,22633491,"MaxQuant Score",138.7100000,1.0000000,,,,0.00025989999994636,-0.4900000
KAFVNSSSIR,ng,N,355,true,"N-Glycopeptide Profiling in Arabidopsis Infloresce",132,27067053,"MOWSE score",19.0000000,,,,,0.012000000104308,
KAFVNSSSIR,ng,N,355,true,"N-linked Glycan Micro-heterogeneity Arabidopsis",134,29237727,,,,,,,,
KAFVNSSSIR,ng,N,355,true,"UDP-GlcNAc transporter glycopeptide analysis",135,30224661,,,,,,,2.4209259208874E-5,0.3000000
