Peptide,PTM,ModifiedAA,ModifiedPosition,PeptideUniqueToGene,ExperimentDesc,ExpID,PubmedID,ScoreType,IdentScore,LocProb,Log2FChange,PQ-val,QuantSig,PEP,MassErrorPPM
MDLSKVGEKFLSSVKSATSL,nta,M,54,true,"Arabidopsis translation initiation landscape - NTA",167a,35069635,,,,,,,,
SATSLGLLPSPSISDRPEIPAR,ph,S,69,true,"TOR Kinase and ABA Receptor",100,29290610,XCorr,3.7740672,0.9593000,,,,6.6770000557881E-5,
SATSLGLLPSPSISDRPEIPAR,ph,S,78,true,"Tissue atlas Arabidopsis - ProteomicsDB",114,32188942,"MaxQuant score",149.9900000,0.8907330,,,,1.2919099848689E-33,
SATSLGLLPSPSISDRPEIPAR,ph,S,80,true,"Large-scale phosphorylation discovery",44,23111157,XCorr,4.5550000,,,,,,
SATSLGLLPSPSISDRPEIPAR,ph,S,80,true,"Phospho cell culture sucrose/TOR",109,30833711,,,0.9279320,,,,,
SATSLGLLPSPSISDRPEIPAR,ph,S,80,true,"Tissue atlas Arabidopsis - ProteomicsDB",114,32188942,"MaxQuant score",200.2300000,0.9679870,,,,0,
ALAGLPSDQR,ph,S,106,true,"atm and atr DNA damage response",88,25561503,"MASCOT Score",34.0000000,1.0000000,,,,,0.0800000
ALAGLPSDQR,ph,S,106,true,"Tissue atlas Arabidopsis - ProteomicsDB",114,32188942,"MaxQuant score",69.4510000,1.0000000,,,,0.0065097999759018,
NSEDRVSSSESPWYYLR,ph,S,499,true,"Tissue atlas Arabidopsis - ProteomicsDB",114,32188942,"MaxQuant score",117.2900000,0.9614880,,,,5.9256999307422E-9,
LTHYREDQDYSSINGEDHEGNDSIHDDVVNPK,ph,S,689,true,"TOR Kinase and ABA Receptor",100,29290610,XCorr,3.9071972,0.8370000,,,,0.0059349997900426,
EDQDYSSINGEDHEGNDSIHDDVVNPK,ph,S,689,true,"Tissue atlas Arabidopsis - ProteomicsDB",114,32188942,"MaxQuant score",112.1300000,0.9682300,,,,5.7003501160278E-28,
INGGSPVSEDENEDLLADFIDEDSQLPR,ph,S,723,true,"SnRK2 protein kinase substrates",85,23776212,XCorr,2.1399741,0.9590000,,,,0.0060205701738596,
CAAVDTVSLVAR,so,C,896,true,"S-sulfenylation site detection using YAP1C",110,32714340,,,,,,,,
