Peptide,PTM,ModifiedAA,ModifiedPosition,PeptideUniqueToGene,ExperimentDesc,ExpID,PubmedID,ScoreType,IdentScore,LocProb,Log2FChange,PQ-val,QuantSig,PEP,MassErrorPPM
ASPTTGDIK,ph,S,17,true,"atm and atr DNA damage response",88,25561503,"MASCOT Score",36.0000000,1.0000000,,,,,-1.8900000
ASPTTGDIK,ph,S,17,true,"Tissue atlas Arabidopsis - ProteomicsDB",114,32188942,"MaxQuant score",112.8900000,0.9994770,,,,0.00045528099872172,
EVKGKDLAELIAAGREKL,nt,E,45,false,"Arabidopsis translation initiation landscape - NT",167b,35069635,,,,,,,,
EKLASVPSGGGGGVAVASATSGGGGGGGAPAAESK,ub,K,61,true,"upl3 mutant / wildtype",168,35926874,"MaxQuant score",104.8800000,1.0000000,0.4276062,0.3297600,NO,8.4741402386951E-22,0.1391800
VASATSGGGGGGGAPAAE,nt,V,75,true,"Arg/N-end rule seed, prt6 vs. Wt",99,29168982,"MASCOT Score",95.5800000,,-0.5218524,0.0742095,NO,6.4520000453427E-10,-1.1620348
SATSGGGGGGGAPAAE,nt,S,77,true,"Arg/N-end rule seed, prt6 vs. Wt",99,29168982,"MASCOT Score",98.3300000,,-0.3226540,0.0806875,NO,1.5199999592319E-10,-1.9319060
LASVPSGGGGGVAVASATSGGGGGGGAPAAESK,ph,S,77,true,"Lateral root-induction - NAA vs control",106,23328941,"MASCOT Score",21.0000000,,,,,,
ATSGGGGGGGAPAAE,nt,A,78,true,"Arg/N-end rule seed, prt6 vs. Wt",99,29168982,"MASCOT Score",83.4100000,,-0.5442127,0.0568943,NO,7.4060002575038E-10,-1.4772093
LASVPSGGGGGVAVASATSGGGGGGGAPAAESK,ph,T,79,true,"Lateral root-induction - NAA vs control",106,23328941,"MASCOT Score",66.0000000,,,,,,
LASVPSGGGGGVAVASATSGGGGGGGAPAAESK,ph,T,79,true,"Col-0 callus - FC Col-0 vs. Col-0 Xray",111a,31410901,,43.3700000,,-0.5182490,0.0000000,NO,,1.0763777
LASVPSGGGGGVAVASATSGGGGGGGAPAAESK,ph,T,79,true,"Col-0 X-ray callus - FC Col-0 vs. Col-0 Xray",111b,31410901,,43.3700000,,-0.5182490,0.0000000,NO,,1.0763777
LASVPSGGGGGVAVASATSGGGGGGGAPAAESK,ph,T,79,true,"atm callus - FC atm vs. atm Xray",111c,31410901,,43.3700000,,-0.2062889,0.0000000,NO,,1.0763777
LASVPSGGGGGVAVASATSGGGGGGGAPAAESK,ph,T,79,true,"atm-3 X-ray callus - FC atm vs. atm Xray",111d,31410901,,43.3700000,,-0.2062889,0.0000000,NO,,1.0763777
SGGGGGGGAPAAE,nt,S,80,true,"Arg/N-end rule seed, prt6 vs. Wt",99,29168982,"MASCOT Score",41.6600000,,0.0763228,0.8472877,NO,0.00029080000240356,-0.1666907
EKLASVPSGGGGGVAVASATSGGGGGGGAPAAESK,ph,S,80,true,"Tissue atlas Arabidopsis - ProteomicsDB",114,32188942,"MaxQuant score",105.7800000,0.8951380,,,,1.0658000015742E-29,
LASVPSGGGGGVAVASATSGGGGGGGAPAAESK,ph,S,80,true,"atm and atr DNA damage response",88,25561503,"MASCOT Score",72.0000000,0.9900000,,,,,-0.3000000
LASVPSGGGGGVAVASATSGGGGGGGAPAAESK,ph,S,80,true,"Phospho cell culture sucrose/TOR",109,30833711,,,0.8507490,,,,,
GGGGGGGAPAAE,nt,G,81,true,"Arg/N-end rule seed, prt6 vs. Wt",99,29168982,"MASCOT Score",34.4000000,,0.3016018,0.1266235,NO,0.020479999482632,-0.5856461
LASVPSGGGGGVAVASATSGGGGGGGAPAAESKKEEK,ph,S,93,true,"Tissue atlas Arabidopsis - ProteomicsDB",114,32188942,"MaxQuant score",100.7100000,0.9999230,,,,3.881509897064E-33,
KEEKEESDDDMGFSLFE,ph,S,105,false,"Arabidopsis root NAA phosphoproteome",18a,27643528,"MaxQuant Score",254.7100000,1.0000000,,,,0,0.0530000
KEEKEESDDDMGFSLFE,ph,S,105,false,"Seed phosphorylation",21,16270910,,,,,,,,
KEEKEESDDDMGFSLFE,ph,S,105,false,"Phosphorylation nuclei-enriched fractions",28,19245862,,,,,,,,
KEEKEESDDDMGFSLFE,ph,S,105,false,"Phosphoproteome iron-deficient Arabidopsis roots",41,22438062,"MASCOT Score",48.7300000,,,,,,
KEEKEESDDDMGFSLFE,ph,S,105,false,"Phosphoproteomic analysis of seed maturation",42,22440515,"MASCOT Score",82.0000000,,,,,,-1.1100000
KEEKEESDDDMGFSLFE,ph,S,105,false,"Large-scale phosphorylation discovery",44,23111157,XCorr,5.1950000,,,,,,
KEEKEESDDDMGFSLFE,ph,S,105,false,"MAPK Arabidopsis substrates",45,23172892,"MaxQuant Score",279.5400000,,,,,,
KEEKEESDDDMGFSLFE,ph,S,105,false,"Phosphoproteome ethylene-regulated time response",46,24043427,"MASCOT Score",32.4800000,,,,,,0.3877200
KEEKEESDDDMGFSLFE,ph,S,105,false,"PAMP-triggered phosphorylation",48,24601666,"MASCOT Score",72.2400000,,,,,,
KEEKEESDDDMGFSLFE,ph,S,105,false,"Tyrosine phosphorylation in Arabidopsis",59,18463617,"MASCOT Score",80.0000000,,,,,,-1.1268665
KEEKEESDDDMGFSLFE,ph,S,105,false,"BSK8 and BSL2 regulating sucrose-ph synthase",66,24924143,"MaxQuant Score",336.1800000,,,,,,0.0506970
KEEKEESDDDMGFSLFE,ph,S,105,false,"srk2dei ABA signaling phopshoproteomics",83,23572148,"MASCOT Score",93.0000000,,,,,,0.0000000
KEEKEESDDDMGFSLFE,ph,S,105,false,"LAXIC - ABA stress",84a,23660473,XCorr,4.4200000,1.0000000,,,,0.055038601160049,
KEEKEESDDDMGFSLFE,ph,S,105,false,"LAXIC - mannitol vs control",84b,23660473,XCorr,4.3300000,1.0000000,,,,3.6500000533124E-7,
KEEKEESDDDMGFSLFE,ph,S,105,false,"SnRK2 protein kinase substrates",85,23776212,XCorr,4.7025032,1.0000000,,,,4.0634000470163E-5,
KEEKEESDDDMGFSLFE,ph,S,105,false,"SIRK1 phosphorylation",86a,23820729,"MaxQuant Score",301.6300000,1.0000000,,,,0,8.4590000
KEEKEESDDDMGFSLFE,ph,S,105,false,"SIRK1 exp - sirk1 mutant vs WT",86b,23820729,,,,-0.2506544,,NO,,
KEEKEESDDDMGFSLFE,ph,S,105,false,"SIRK1 exp - 35S:SIRK1 vs WT",86c,23820729,,,,0.4204796,,NO,,
KEEKEESDDDMGFSLFE,ph,S,105,false,"atm and atr DNA damage response",88,25561503,"MASCOT Score",65.0000000,1.0000000,,,,,0.0000000
KEEKEESDDDMGFSLFE,ph,S,105,false,"Brassinosteroid-Regulated Phosphorylation Dynamics",94,26187819,"MaxQuant Score",216.3000000,1.0000000,,,,0,0.5060000
KEEKEESDDDMGFSLFE,ph,S,105,false,"TOR Kinase and ABA Receptor",100,29290610,XCorr,4.2432776,1.0000000,,,,0.005919000133872,
KEEKEESDDDMGFSLFE,ph,S,105,false,"Phospho cell culture sucrose/TOR",109,30833711,,,1.0000000,,,,,
KEEKEESDDDMGFSLFE,ph,S,105,false,"Tissue atlas Arabidopsis - ProteomicsDB",114,32188942,"MaxQuant score",333.5900000,1.0000000,,,,0,
KEEKEESDDDMGFSLFE,ph,S,105,false,"Touch-induced phosphorylation: 40s touch vs untouc",136,30291188,"MASCOT score",80.4200000,,-0.1791258,0.2742494,NO,,2.1470106
EEKEESDDDMGFSLFE,ph,S,105,false,"Phosphorylation nuclei-enriched fractions",28,19245862,,,,,,,,
EEKEESDDDMGFSLFE,ph,S,105,false,"Phosphoproteomic analysis of seed maturation",42,22440515,"MASCOT Score",58.0000000,,,,,,-1.4900000
EEKEESDDDMGFSLFE,ph,S,105,false,"Large-scale phosphorylation discovery",44,23111157,XCorr,4.2970000,,,,,,
EEKEESDDDMGFSLFE,ph,S,105,false,"PAMP-triggered phosphorylation",48,24601666,"MASCOT Score",68.0700000,,,,,,
EEKEESDDDMGFSLFE,ph,S,105,false,"Tyrosine phosphorylation in Arabidopsis",59,18463617,"MASCOT Score",54.0000000,,,,,,-1.4100752
EEKEESDDDMGFSLFE,ph,S,105,false,"srk2dei ABA signaling phopshoproteomics",83,23572148,"MASCOT Score",59.0000000,,,,,,0.0017000
EEKEESDDDMGFSLFE,ph,S,105,false,"LAXIC - ABA stress",84a,23660473,XCorr,4.5700000,1.0000000,,,,0.0013668900355697,
EEKEESDDDMGFSLFE,ph,S,105,false,"LAXIC - mannitol vs control",84b,23660473,XCorr,4.8700000,1.0000000,1.5556499,,NO,1.0700000530051E-6,
EEKEESDDDMGFSLFE,ph,S,105,false,"SnRK2 protein kinase substrates",85,23776212,XCorr,4.6086030,1.0000000,,,,1.1137100475108E-15,
EEKEESDDDMGFSLFE,ph,S,105,false,"SIRK1 phosphorylation",86a,23820729,"MaxQuant Score",264.1100000,1.0000000,,,,1.9200001006285E-21,3.4750000
EEKEESDDDMGFSLFE,ph,S,105,false,"SIRK1 exp - sirk1 mutant vs WT",86b,23820729,,,,-0.8090005,,NO,,
EEKEESDDDMGFSLFE,ph,S,105,false,"SIRK1 exp - 35S:SIRK1 vs WT",86c,23820729,,,,0.9751789,,NO,,
EEKEESDDDMGFSLFE,ph,S,105,false,"atm and atr DNA damage response",88,25561503,"MASCOT Score",61.0000000,1.0000000,,,,,-0.2000000
EEKEESDDDMGFSLFE,ph,S,105,false,"TOR Kinase and ABA Receptor",100,29290610,XCorr,5.0813303,1.0000000,,,,2.3619999410585E-5,
EEKEESDDDMGFSLFE,ph,S,105,false,"Col-0 callus - FC Col-0 vs. Col-0 Xray",111a,31410901,,57.4300000,,0.1789351,0.0000000,NO,,1.5052564
EEKEESDDDMGFSLFE,ph,S,105,false,"Col-0 X-ray callus - FC Col-0 vs. Col-0 Xray",111b,31410901,,57.4300000,,0.1789351,0.0000000,NO,,1.5052564
EEKEESDDDMGFSLFE,ph,S,105,false,"atm callus - FC atm vs. atm Xray",111c,31410901,,57.4300000,,-0.3601741,0.0000000,NO,,1.5052564
EEKEESDDDMGFSLFE,ph,S,105,false,"atm-3 X-ray callus - FC atm vs. atm Xray",111d,31410901,,57.4300000,,-0.3601741,0.0000000,NO,,1.5052564
EESDDDMGFSLFE,ph,S,105,false,"Cytosolic ribosome Ph",26,17934214,,,,,,,,
EESDDDMGFSLFE,ph,S,105,false,"Large-scale phosphorylation discovery",44,23111157,XCorr,3.7570000,,,,,,
EESDDDMGFSLFE,ph,S,105,false,"Tyrosine phosphorylation in Arabidopsis",59,18463617,"MASCOT Score",76.0000000,,,,,,-0.8127382
EESDDDMGFSLFE,ph,S,105,false,"srk2dei ABA signaling phopshoproteomics",83,23572148,"MASCOT Score",80.0000000,,,,,,0.0005000
EESDDDMGFSLFE,ph,S,105,false,"LAXIC - ABA stress",84a,23660473,XCorr,4.0900000,1.0000000,,,,2.470000026733E-7,
EESDDDMGFSLFE,ph,S,105,false,"LAXIC - mannitol vs control",84b,23660473,XCorr,3.9400000,1.0000000,,,,4.2200001189485E-5,
EESDDDMGFSLFE,ph,S,105,false,"SnRK2 protein kinase substrates",85,23776212,XCorr,3.8280842,1.0000000,,,,1.9627499625585E-8,
EESDDDMGFSLFE,ph,S,105,false,"SIRK1 phosphorylation",86a,23820729,"MaxQuant Score",220.7500000,1.0000000,,,,2.1299999843905E-6,2.3060000
EESDDDMGFSLFE,ph,S,105,false,"SIRK1 exp - sirk1 mutant vs WT",86b,23820729,,,,-0.6686346,,NO,,
EESDDDMGFSLFE,ph,S,105,false,"SIRK1 exp - 35S:SIRK1 vs WT",86c,23820729,,,,0.4039728,,NO,,
EESDDDMGFSLFE,ph,S,105,false,"atm and atr DNA damage response",88,25561503,"MASCOT Score",48.0000000,1.0000000,,,,,-0.1200000
EESDDDMGFSLFE,ph,S,105,false,"TOR Kinase and ABA Receptor",100,29290610,XCorr,5.2516170,1.0000000,,,,2.307999977802E-7,
EESDDDMGFSLFE,ph,S,105,false,"Lateral root-induction - NAA vs control",106,23328941,"MASCOT Score",31.0000000,,,,,,
KEEKEESDDDMGFSLFE,ph,S,112,false,"Large-scale phosphorylation discovery",44,23111157,XCorr,5.1340000,,,,,,
KEEKEESDDDMGFSLFE,ph,S,112,false,"srk2dei ABA signaling phopshoproteomics",83,23572148,"MASCOT Score",25.0000000,,,,,,-0.0004000
KEEKEESDDDMGFSLFE,ph,S,112,false,"SIRK1 phosphorylation",86a,23820729,"MaxQuant Score",88.8880000,0.9900000,,,,0.75300002098083,7.4970000
KEEKEESDDDMGFSLFE,ph,S,112,false,"atm and atr DNA damage response",88,25561503,"MASCOT Score",27.0000000,0.9770000,,,,,1.5300000
KEEKEESDDDMGFSLFE,ph,S,112,false,"Tissue atlas Arabidopsis - ProteomicsDB",114,32188942,"MaxQuant score",174.2000000,1.0000000,,,,6.0693095138775E-39,
