Peptide,PTM,ModifiedAA,ModifiedPosition,PeptideUniqueToGene,ExperimentDesc,ExpID,PubmedID,ScoreType,IdentScore,LocProb,Log2FChange,PQ-val,QuantSig,PEP,MassErrorPPM
SQCNDLSDADLYPLSLDNTQGPRPVR,ph,S,364,true,"Tissue atlas Arabidopsis - ProteomicsDB",114,32188942,"MaxQuant score",136.7300000,1.0000000,,,,1.2205309624269E-42,
GGLQGSNSPIQSPR,ph,S,426,true,"Lateral root-induction - NAA vs control",106,23328941,"MASCOT Score",27.0000000,,,,,,
GGLQGSNSPIQSPRGPQTR,ph,S,428,true,"Brassinosteroid-Regulated Phosphorylation Dynamics",94,26187819,"MaxQuant Score",107.5600000,0.9920000,,,,0.003000000026077,0.8880000
GGLQGSNSPIQSPR,ph,S,428,true,"atm and atr DNA damage response",88,25561503,"MASCOT Score",59.0000000,1.0000000,,,,,-1.2100000
GGLQGSNSPIQSPR,ph,S,428,true,"TOR Kinase and ABA Receptor",100,29290610,XCorr,3.5442488,0.9865000,,,,0.0038729999214411,
GGLQGSNSPIQSPR,ph,S,428,true,"Lateral root-induction - NAA vs control",106,23328941,"MASCOT Score",29.0000000,,,,,,
GGLQGSNSPIQSPR,ph,S,428,true,"Tissue atlas Arabidopsis - ProteomicsDB",114,32188942,"MaxQuant score",290.5300000,1.0000000,,,,0,
GGLQGSNSPIQSPRGPQTR,ph,S,432,true,"Brassinosteroid-Regulated Phosphorylation Dynamics",94,26187819,"MaxQuant Score",107.5600000,1.0000000,,,,0.003000000026077,0.8880000
GGLQGSNSPIQSPR,ph,S,432,true,"atm and atr DNA damage response",88,25561503,"MASCOT Score",59.0000000,1.0000000,,,,,-1.2100000
GGLQGSNSPIQSPR,ph,S,432,true,"Lateral root-induction - NAA vs control",106,23328941,"MASCOT Score",21.0000000,,,,,,
GGLQGSNSPIQSPR,ph,S,432,true,"Tissue atlas Arabidopsis - ProteomicsDB",114,32188942,"MaxQuant score",271.4700000,1.0000000,,,,0,
