Peptide,PTM,ModifiedAA,ModifiedPosition,PeptideUniqueToGene,ExperimentDesc,ExpID,PubmedID,ScoreType,IdentScore,LocProb,Log2FChange,PQ-val,QuantSig,PEP,MassErrorPPM
MYSNFKEQAIEY,nta,M,1,true,"Arg/N-end rule seed, prt6 vs. Wt",99,29168982,"MASCOT Score",36.4300000,,0.0524092,0.8772222,NO,0.0433100014925,-4.9990155
AVLDEGGSGPGSNGDAAVATRPK,ph,S,78,true,"Tissue atlas Arabidopsis - ProteomicsDB",114,32188942,"MaxQuant score",114.1300000,0.9629020,,,,4.9934898420189E-17,
AVLDEGGSGPGSNGDAAVATRPK,ph,S,82,true,"Tissue atlas Arabidopsis - ProteomicsDB",114,32188942,"MaxQuant score",198.1000000,0.9999910,,,,0,
AGLNSAIVR,ph,S,120,true,"Tissue atlas Arabidopsis - ProteomicsDB",114,32188942,"MaxQuant score",111.5000000,1.0000000,,,,0.00048970599891618,
FPQFFTGKR,ph,T,159,true,"Tissue atlas Arabidopsis - ProteomicsDB",114,32188942,"MaxQuant score",121.9000000,1.0000000,,,,0.00015315599739552,
TEGFSGSDVSVCVK,sno,C,342,true,"Site-specific nitrosomeproteomic id - gsnor1-3",90b,25699590,XCorr,3.4300000,,,,,0.027510000392795,-7.3700000
TEGFSGSDVSVCVK,sno,C,342,true,"hot5-4 / wildtype, FAT-switch S-nitrosoproteome",169,37277371,,,,0.2110501,0.0323404,NO,,
TEGFSGSDVSVCVK,so,C,342,true,"S-sulfenylation site detection using YAP1C",110,32714340,,,,,,,,
TDFEKVLAR,ub,K,407,true,"Arabidopsis ubiquitination COFRADIC",40,26744219,"MaxQuant Score",62.4630000,1.0000000,,,,0.0070000002160668,-0.6330000
QRPTVSKSDLDVHER,ph,S,419,true,"Tissue atlas Arabidopsis - ProteomicsDB",114,32188942,"MaxQuant score",59.1630000,0.9352370,,,,0.00062635098583996,
