Peptide,PTM,ModifiedAA,ModifiedPosition,PeptideUniqueToGene,ExperimentDesc,ExpID,PubmedID,ScoreType,IdentScore,LocProb,Log2FChange,PQ-val,QuantSig,PEP,MassErrorPPM
MKKYGLQIR,nta,M,1,true,"Arabidopsis translation initiation landscape - NTA",167a,35069635,,,,,,,,
YIQNLMKQAER,ub,K,103,true,"Arabidopsis ubiquitination COFRADIC",40,26744219,"MaxQuant Score",58.1720000,1.0000000,,,,0.0020000000949949,-0.5580000
EKEHEIVYER,ub,K,110,false,"Arabidopsis ubiquitination COFRADIC",40,26744219,"MaxQuant Score",54.2590000,1.0000000,,,,0.0099999997764826,0.1750000
EVEAKEAEKLEEQR,ub,K,195,true,"Arabidopsis ubiquitination COFRADIC",40,26744219,"MaxQuant Score",106.1400000,1.0000000,,,,2.864000083234E-15,-0.5800000
EVEAKEAEKLEEQR,ub,K,199,true,"Arabidopsis ubiquitination COFRADIC",40,26744219,"MaxQuant Score",106.1400000,1.0000000,,,,2.864000083234E-15,-0.5800000
KAEKLEEQR,ub,K,205,true,"Arabidopsis ubiquitination COFRADIC",40,26744219,"MaxQuant Score",81.0170000,1.0000000,,,,0.003000000026077,0.2520000
KAEKLEEQR,ub,K,208,true,"Arabidopsis ubiquitination COFRADIC",40,26744219,"MaxQuant Score",48.2840000,1.0000000,,,,0.018999999389052,-0.3710000
KAEKLEELR,ub,K,217,true,"Arabidopsis ubiquitination COFRADIC",40,26744219,"MaxQuant Score",107.2100000,1.0000000,,,,0.00033260000054725,0.5780000
SPEKEVSPDSGEFGSSR,ph,S,234,true,"atm and atr DNA damage response",88,25561503,"MASCOT Score",53.0000000,1.0000000,,,,,0.5900000
SPEKEVSPDSGEFGSSR,ph,S,234,true,"Phospho cell culture sucrose/TOR",109,30833711,,,0.9994430,,,,,
SPEKEVSPDSGEFGSSR,ph,S,234,true,"Tissue atlas Arabidopsis - ProteomicsDB",114,32188942,"MaxQuant score",105.7700000,1.0000000,,,,1.1981300076513E-6,
SPEKEVSPDSGEFGSSR,ph,S,240,true,"atm and atr DNA damage response",88,25561503,"MASCOT Score",34.0000000,1.0000000,,,,,0.3400000
EVSPDSGEFGSSR,ph,S,240,true,"STN8 phosphoproteome",38,21768351,"MASCOT Score",50.7100000,,,,,,-1.0451800
EVSPDSGEFGSSR,ph,S,240,true,"Tyrosine phosphorylation in Arabidopsis",59,18463617,"MASCOT Score",66.0000000,,,,,,-0.9074730
EVSPDSGEFGSSR,ph,S,240,true,"Chloroplast kinase substrates",60,19376835,"MASCOT Score",50.1200000,,,,,,-0.5432880
EVSPDSGEFGSSR,ph,S,240,true,"srk2dei ABA signaling phopshoproteomics",83,23572148,"MASCOT Score",51.0000000,,,,,,0.0005000
EVSPDSGEFGSSR,ph,S,240,true,"atm and atr DNA damage response",88,25561503,"MASCOT Score",64.0000000,1.0000000,,,,,0.0000000
EVSPDSGEFGSSR,ph,S,240,true,"TOR Kinase and ABA Receptor",100,29290610,XCorr,3.5342934,0.9062000,,,,0.0019940000493079,
EVSPDSGEFGSSR,ph,S,240,true,"Lateral root-induction - NAA vs control",106,23328941,"MASCOT Score",35.0000000,,,,,,
EVSPDSGEFGSSR,ph,S,240,true,"Tissue atlas Arabidopsis - ProteomicsDB",114,32188942,"MaxQuant score",153.8100000,1.0000000,,,,4.9704901528003E-8,
EVSPDSGEFGSSR,ph,S,243,true,"Tyrosine phosphorylation in Arabidopsis",59,18463617,"MASCOT Score",21.0000000,,,,,,-2.7922302
EVSPDSGEFGSSR,ph,S,243,true,"srk2dei ABA signaling phopshoproteomics",83,23572148,"MASCOT Score",45.0000000,,,,,,0.0000000
EVSPDSGEFGSSR,ph,S,243,true,"atm and atr DNA damage response",88,25561503,"MASCOT Score",64.0000000,1.0000000,,,,,0.0000000
EVSPDSGEFGSSR,ph,S,243,true,"Tissue atlas Arabidopsis - ProteomicsDB",114,32188942,"MaxQuant score",86.2140000,0.9995800,,,,0.00041948500438593,
SKSLEPLEAEQAVSEK,ph,S,251,true,"Phosphoproteome iron-deficient Arabidopsis roots",41,22438062,"MASCOT Score",61.7600000,,,,,,
SKSLEPLEAEQAVSEK,ph,S,251,true,"LAXIC - mannitol vs control",84b,23660473,XCorr,3.2200000,1.0000000,-1.0139389,,NO,0.054019700735807,
SKSLEPLEAEQAVSEK,ph,S,251,true,"Phospho cell culture sucrose/TOR",109,30833711,,,0.9161420,,,,,
SKSLEPLEAEQAVSEK,ph,S,251,true,"Tissue atlas Arabidopsis - ProteomicsDB",114,32188942,"MaxQuant score",159.0100000,1.0000000,,,,7.7886299027028E-14,
SKSLEPLEAEQAVSEKEMGSDGTEER,ph,S,253,true,"atm and atr DNA damage response",88,25561503,"MASCOT Score",47.0000000,0.8840000,,,,,0.2900000
SKSLEPLEAEQAVSEK,ph,S,253,true,"Phosphoproteome iron-deficient Arabidopsis roots",41,22438062,"MASCOT Score",67.3000000,,,,,,
SKSLEPLEAEQAVSEK,ph,S,253,true,"Phosphoproteome ethylene-regulated time response",46,24043427,"MASCOT Score",71.6200000,,,,,,-13.9936000
SKSLEPLEAEQAVSEK,ph,S,253,true,"LAXIC - ABA stress",84a,23660473,XCorr,4.0200000,0.9370000,,,,0.00079119298607111,
SKSLEPLEAEQAVSEK,ph,S,253,true,"LAXIC - mannitol vs control",84b,23660473,XCorr,3.6100000,0.9560000,-1.0139389,,NO,2.8599998813661E-7,
SKSLEPLEAEQAVSEK,ph,S,253,true,"SnRK2 protein kinase substrates",85,23776212,XCorr,3.8033025,0.9570000,,,,0.0009280220256187,
SKSLEPLEAEQAVSEK,ph,S,253,true,"atm and atr DNA damage response",88,25561503,"MASCOT Score",74.0000000,0.9610000,,,,,0.0700000
SKSLEPLEAEQAVSEK,ph,S,253,true,"Protein sumoylation and phosphorylation cross-talk",97,28419593,,,,,,,,
SKSLEPLEAEQAVSEK,ph,S,253,true,"Phospho cell culture sucrose/TOR",109,30833711,,,0.9954080,,,,,
SKSLEPLEAEQAVSEK,ph,S,253,true,"Col-0 callus - FC Col-0 vs. Col-0 Xray",111a,31410901,,78.8900000,,0.1354220,0.0000000,NO,,1.1659880
SKSLEPLEAEQAVSEK,ph,S,253,true,"Col-0 X-ray callus - FC Col-0 vs. Col-0 Xray",111b,31410901,,78.8900000,,0.1354220,0.0000000,NO,,1.1659880
SKSLEPLEAEQAVSEK,ph,S,253,true,"atm callus - FC atm vs. atm Xray",111c,31410901,,78.8900000,,0.1861325,0.0000000,NO,,1.1659880
SKSLEPLEAEQAVSEK,ph,S,253,true,"atm-3 X-ray callus - FC atm vs. atm Xray",111d,31410901,,78.8900000,,0.1861325,0.0000000,NO,,1.1659880
SKSLEPLEAEQAVSEK,ph,S,253,true,"Touch-induced phosphorylation: 40s touch vs untouc",136,30291188,"MASCOT score",83.2000000,,0.0035203,0.9853140,NO,,7.5686324
SLEPLEAEQAVSEK,ph,S,253,true,"STN8 phosphoproteome",38,21768351,"MASCOT Score",70.7700000,,,,,,-1.7559500
SLEPLEAEQAVSEK,ph,S,253,true,"Tyrosine phosphorylation in Arabidopsis",59,18463617,"MASCOT Score",81.0000000,,,,,,-1.2432196
SLEPLEAEQAVSEK,ph,S,253,true,"Chloroplast kinase substrates",60,19376835,"MASCOT Score",97.8500000,,,,,,-0.7750350
SLEPLEAEQAVSEK,ph,S,253,true,"srk2dei ABA signaling phopshoproteomics",83,23572148,"MASCOT Score",95.0000000,,,,,,-0.0004000
SLEPLEAEQAVSEK,ph,S,253,true,"LAXIC - mannitol vs control",84b,23660473,XCorr,2.2200000,1.0000000,,,,5.4500001169799E-6,
SLEPLEAEQAVSEK,ph,S,253,true,"atm and atr DNA damage response",88,25561503,"MASCOT Score",42.0000000,1.0000000,,,,,-0.1400000
SLEPLEAEQAVSEK,ph,S,253,true,"Brassinosteroid-Regulated Phosphorylation Dynamics",94,26187819,"MaxQuant Score",93.3810000,1.0000000,,,,0.012000000104308,0.9160000
SLEPLEAEQAVSEK,ph,S,253,true,"TOR Kinase and ABA Receptor",100,29290610,XCorr,4.0449657,1.0000000,,,,4.2799998482224E-5,
SLEPLEAEQAVSEK,ph,S,253,true,"Lateral root-induction - NAA vs control",106,23328941,"MASCOT Score",62.0000000,,,,,,
SLEPLEAEQAVSEK,ph,S,253,true,"Col-0 callus - FC Col-0 vs. Col-0 Xray",111a,31410901,,60.7300000,,0.7622431,0.0000000,NO,,1.2225477
SLEPLEAEQAVSEK,ph,S,253,true,"Col-0 X-ray callus - FC Col-0 vs. Col-0 Xray",111b,31410901,,60.7300000,,0.7622431,0.0000000,NO,,1.2225477
SLEPLEAEQAVSEK,ph,S,253,true,"atm callus - FC atm vs. atm Xray",111c,31410901,,60.7300000,,0.4213537,0.0000000,NO,,1.2225477
SLEPLEAEQAVSEK,ph,S,253,true,"atm-3 X-ray callus - FC atm vs. atm Xray",111d,31410901,,60.7300000,,0.4213537,0.0000000,NO,,1.2225477
SLEPLEAEQAVSEK,ph,S,253,true,"Tissue atlas Arabidopsis - ProteomicsDB",114,32188942,"MaxQuant score",242.3600000,1.0000000,,,,0,
SLEPLEAEQAVSEK,ph,S,264,true,"Conserved plant phosphoproteome - Arabidopsis",61a,20466843,"MASCOT Score",28.0000000,1.0000000,,,,,
SLEPLEAEQAVSEK,ph,S,264,true,"srk2dei ABA signaling phopshoproteomics",83,23572148,"MASCOT Score",22.0000000,,,,,,-0.0005000
SLEPLEAEQAVSEK,ph,S,264,true,"Tissue atlas Arabidopsis - ProteomicsDB",114,32188942,"MaxQuant score",197.1500000,1.0000000,,,,5.703849932709E-36,
REDAIAAAKER,ub,K,305,true,"Arabidopsis ubiquitination COFRADIC",40,26744219,"MaxQuant Score",90.0500000,1.0000000,,,,0.0020000000949949,0.3180000
