Peptide,PTM,ModifiedAA,ModifiedPosition,PeptideUniqueToGene,ExperimentDesc,ExpID,PubmedID,ScoreType,IdentScore,LocProb,Log2FChange,PQ-val,QuantSig,PEP,MassErrorPPM
ADVNLPPSDSVDNRLPE,nt,A,2,true,"Arg/N-end rule seed, prt6 vs. Wt",99,29168982,"MASCOT Score",20.7100000,,,,,0.0031079999171197,-6.8503151
ADVNLPPSDSVDNR,nt,A,2,true,"Arg/N-end rule seed, prt6 vs. Wt",99,29168982,"MASCOT Score",70.6200000,,,,,0.00097100000130013,-2.6559916
ADVNLPPSDSVDNRLPE,nta,A,2,true,"Arg/N-end rule seed, prt6 vs. Wt",99,29168982,"MASCOT Score",20.7100000,,,,,0.0031079999171197,-6.8503151
ADVNLPPSDSVDNRLPE,nta,A,2,true,"Arabidopsis translation initiation landscape - NTA",167a,35069635,,,,,,,,
ADVNLPPSDSVDNR,nta,A,2,true,"Arg/N-end rule seed, prt6 vs. Wt",99,29168982,"MASCOT Score",70.6200000,,,,,0.00097100000130013,-2.6559916
ADVNLPPSDSVDNR,nta,A,2,true,"HUNTER N-terminome: legumain, GluC and trypsin",119,31951383,"MaxQuant score",99.5220000,,,,,,
ADVNLPPSDSVDNRLPEK,ph,S,11,true,"Tissue atlas Arabidopsis - ProteomicsDB",114,32188942,"MaxQuant score",114.7500000,0.9603860,,,,1.7958899645176E-10,
STSSSPPPPPPSSSLPQQEQEQDQQQLPLRR,ph,S,20,true,"Conserved plant phosphoproteome - Arabidopsis",61a,20466843,"MASCOT Score",60.0000000,1.0000000,,,,,
STSSSPPPPPPSSSLPQQEQEQDQQQLPLR,ph,S,20,true,"Large-scale phosphorylation discovery",44,23111157,XCorr,5.9430000,,,,,,
STSSSPPPPPPSSSLPQQEQEQDQQQLPLR,ph,T,21,true,"Large-scale phosphorylation discovery",44,23111157,XCorr,5.6480000,,,,,,
STSSSPPPPPPSSSLPQQEQEQDQQQLPLRR,ph,S,22,true,"PAMP-triggered phosphorylation",48,24601666,"MASCOT Score",61.8600000,,,,,,
STSSSPPPPPPSSSLPQQEQEQDQQQLPLRR,ph,S,22,true,"srk2dei ABA signaling phopshoproteomics",83,23572148,"MASCOT Score",89.0000000,,,,,,-0.0043000
STSSSPPPPPPSSSLPQQEQEQDQQQLPLRR,ph,S,22,true,"Phospho cell culture sucrose/TOR",109,30833711,,,0.8740420,,,,,
STSSSPPPPPPSSSLPQQEQEQDQQQLPLRR,ph,S,22,true,"Tissue atlas Arabidopsis - ProteomicsDB",114,32188942,"MaxQuant score",252.1400000,0.9935540,,,,0,
STSSSPPPPPPSSSLPQQEQEQDQQQLPLR,ph,S,22,true,"PAMP-triggered phosphorylation",48,24601666,"MASCOT Score",43.0200000,,,,,,
STSSSPPPPPPSSSLPQQEQEQDQQQLPLRR,ph,S,23,true,"PAMP-triggered phosphorylation",48,24601666,"MASCOT Score",61.8600000,,,,,,
STSSSPPPPPPSSSLPQQEQEQDQQQLPLRR,ph,S,23,true,"srk2dei ABA signaling phopshoproteomics",83,23572148,"MASCOT Score",88.0000000,,,,,,-0.0058000
STSSSPPPPPPSSSLPQQEQEQDQQQLPLRR,ph,S,23,true,"Col-0 callus - FC Col-0 vs. Col-0 Xray",111a,31410901,,37.4200000,,0.8551265,0.0389147,YES,,1.0851785
STSSSPPPPPPSSSLPQQEQEQDQQQLPLRR,ph,S,23,true,"Col-0 X-ray callus - FC Col-0 vs. Col-0 Xray",111b,31410901,,37.4200000,,0.8551265,0.0389147,YES,,1.0851785
STSSSPPPPPPSSSLPQQEQEQDQQQLPLRR,ph,S,23,true,"atm callus - FC atm vs. atm Xray",111c,31410901,,37.4200000,,0.7609683,0.2474180,NO,,1.0851785
STSSSPPPPPPSSSLPQQEQEQDQQQLPLRR,ph,S,23,true,"atm-3 X-ray callus - FC atm vs. atm Xray",111d,31410901,,37.4200000,,0.7609683,0.2474180,NO,,1.0851785
STSSSPPPPPPSSSLPQQEQEQDQQQLPLR,ph,S,23,true,"Large-scale phosphorylation discovery",44,23111157,XCorr,5.0310000,,,,,,
STSSSPPPPPPSSSLPQQEQEQDQQQLPLR,ph,S,23,true,"PAMP-triggered phosphorylation",48,24601666,"MASCOT Score",43.0200000,,,,,,
STSSSPPPPPPSSSLPQQEQEQDQQQLPLR,ph,S,23,true,"Lateral root-induction - NAA vs control",106,23328941,"MASCOT Score",32.0000000,,,,,,
STSSSPPPPPPSSSLPQQEQEQDQQQLPLRR,ph,S,24,true,"PAMP-triggered phosphorylation",48,24601666,"MASCOT Score",44.0900000,,,,,,
STSSSPPPPPPSSSLPQQEQEQDQQQLPLRR,ph,S,24,true,"srk2dei ABA signaling phopshoproteomics",83,23572148,"MASCOT Score",88.0000000,,,,,,-0.0058000
STSSSPPPPPPSSSLPQQEQEQDQQQLPLRR,ph,S,24,true,"TOR Kinase and ABA Receptor",100,29290610,XCorr,2.9162722,0.7501000,,,,0.03091000020504,
STSSSPPPPPPSSSLPQQEQEQDQQQLPLRR,ph,S,24,true,"Phospho cell culture sucrose/TOR",109,30833711,,,0.9458850,,,,,
STSSSPPPPPPSSSLPQQEQEQDQQQLPLRR,ph,S,24,true,"Col-0 callus - FC Col-0 vs. Col-0 Xray",111a,31410901,,37.4200000,,0.8551265,0.0389147,YES,,1.0851785
STSSSPPPPPPSSSLPQQEQEQDQQQLPLRR,ph,S,24,true,"Col-0 X-ray callus - FC Col-0 vs. Col-0 Xray",111b,31410901,,37.4200000,,0.8551265,0.0389147,YES,,1.0851785
STSSSPPPPPPSSSLPQQEQEQDQQQLPLRR,ph,S,24,true,"atm callus - FC atm vs. atm Xray",111c,31410901,,37.4200000,,0.7609683,0.2474180,NO,,1.0851785
STSSSPPPPPPSSSLPQQEQEQDQQQLPLRR,ph,S,24,true,"atm-3 X-ray callus - FC atm vs. atm Xray",111d,31410901,,37.4200000,,0.7609683,0.2474180,NO,,1.0851785
STSSSPPPPPPSSSLPQQEQEQDQQQLPLRR,ph,S,24,true,"Tissue atlas Arabidopsis - ProteomicsDB",114,32188942,"MaxQuant score",252.1400000,0.9681900,,,,0,
STSSSPPPPPPSSSLPQQEQEQDQQQLPLR,ph,S,24,true,"Lateral root-induction - NAA vs control",106,23328941,"MASCOT Score",32.0000000,,,,,,
STSSSPPPPPPSSSLPQQEQEQDQQQLPLRR,ph,S,31,true,"srk2dei ABA signaling phopshoproteomics",83,23572148,"MASCOT Score",27.0000000,,,,,,0.0005000
STSSSPPPPPPSSSLPQQEQEQDQQQLPLR,ph,S,31,true,"Large-scale phosphorylation discovery",44,23111157,XCorr,5.9430000,,,,,,
STSSSPPPPPPSSSLPQQEQEQDQQQLPLR,ph,S,31,true,"Col-0 callus - FC Col-0 vs. Col-0 Xray",111a,31410901,,25.7100000,,0.9425869,0.0000000,NO,,1.3026140
STSSSPPPPPPSSSLPQQEQEQDQQQLPLR,ph,S,31,true,"Col-0 X-ray callus - FC Col-0 vs. Col-0 Xray",111b,31410901,,25.7100000,,0.9425869,0.0000000,NO,,1.3026140
STSSSPPPPPPSSSLPQQEQEQDQQQLPLR,ph,S,31,true,"atm callus - FC atm vs. atm Xray",111c,31410901,,25.7100000,,0.9738431,0.0000000,NO,,1.3026140
STSSSPPPPPPSSSLPQQEQEQDQQQLPLR,ph,S,31,true,"atm-3 X-ray callus - FC atm vs. atm Xray",111d,31410901,,25.7100000,,0.9738431,0.0000000,NO,,1.3026140
STSSSPPPPPPSSSLPQQEQEQDQQQLPLR,ph,S,32,true,"Conserved plant phosphoproteome - Arabidopsis",61a,20466843,"MASCOT Score",50.0000000,1.0000000,,,,,
STSSSPPPPPPSSSLPQQEQEQDQQQLPLR,ph,S,32,true,"Col-0 callus - FC Col-0 vs. Col-0 Xray",111a,31410901,,25.7100000,,0.9425869,0.0000000,NO,,1.3026140
STSSSPPPPPPSSSLPQQEQEQDQQQLPLR,ph,S,32,true,"Col-0 X-ray callus - FC Col-0 vs. Col-0 Xray",111b,31410901,,25.7100000,,0.9425869,0.0000000,NO,,1.3026140
STSSSPPPPPPSSSLPQQEQEQDQQQLPLR,ph,S,32,true,"atm callus - FC atm vs. atm Xray",111c,31410901,,25.7100000,,0.9738431,0.0000000,NO,,1.3026140
STSSSPPPPPPSSSLPQQEQEQDQQQLPLR,ph,S,32,true,"atm-3 X-ray callus - FC atm vs. atm Xray",111d,31410901,,25.7100000,,0.9738431,0.0000000,NO,,1.3026140
STSSSPPPPPPSSSLPQQEQEQDQQQLPLRR,ph,S,33,true,"srk2dei ABA signaling phopshoproteomics",83,23572148,"MASCOT Score",75.0000000,,,,,,-0.0058000
STSSSPPPPPPSSSLPQQEQEQDQQQLPLR,ph,S,33,true,"Conserved plant phosphoproteome - Arabidopsis",61a,20466843,"MASCOT Score",50.0000000,1.0000000,,,,,
ERDRSPLPPPR,ph,S,76,true,"Tyrosine phosphorylation in Arabidopsis",59,18463617,"MASCOT Score",21.0000000,,,,,,-0.1429923
ERDRSPLPPPR,ph,S,76,true,"atm and atr DNA damage response",88,25561503,"MASCOT Score",35.0000000,1.0000000,,,,,-0.8100000
ERDRSPLPPPR,ph,S,76,true,"TOR Kinase and ABA Receptor",100,29290610,XCorr,3.3464346,1.0000000,,,,0.00072960002580658,
DRSPLPPPRR,ph,S,76,true,"Tyrosine phosphorylation in Arabidopsis",59,18463617,"MASCOT Score",23.0000000,,,,,,-0.9451550
DRSPLPPPRR,ph,S,76,true,"Chloroplast kinase substrates",60,19376835,"MASCOT Score",32.3200000,,,,,,-0.2207300
DRSPLPPPRR,ph,S,76,true,"srk2dei ABA signaling phopshoproteomics",83,23572148,"MASCOT Score",31.0000000,,,,,,0.0000000
DRSPLPPPRR,ph,S,76,true,"TOR Kinase and ABA Receptor",100,29290610,XCorr,2.7141683,1.0000000,,,,0.018789999186993,
DRSPLPPPR,ph,S,76,true,"Ethylene-regulated phosphorylation ein2 mutant",30,19253305,"MASCOT Score",37.2549000,,,,,,-25.4328440
DRSPLPPPR,ph,S,76,true,"STN8 phosphoproteome",38,21768351,"MASCOT Score",49.8700000,,,,,,0.0910921
DRSPLPPPR,ph,S,76,true,"Tyrosine phosphorylation in Arabidopsis",59,18463617,"MASCOT Score",21.0000000,,,,,,-0.3592171
DRSPLPPPR,ph,S,76,true,"Chloroplast kinase substrates",60,19376835,"MASCOT Score",49.0800000,,,,,,-1.0384000
DRSPLPPPR,ph,S,76,true,"LAXIC - mannitol vs control",84b,23660473,XCorr,2.0500000,1.0000000,,,,0.12153799831867,
DRSPLPPPR,ph,S,76,true,"SnRK2 protein kinase substrates",85,23776212,XCorr,2.2819266,1.0000000,,,,0.1006890013814,
DRSPLPPPR,ph,S,76,true,"atm and atr DNA damage response",88,25561503,"MASCOT Score",36.0000000,1.0000000,,,,,0.0200000
DRSPLPPPR,ph,S,76,true,"TOR Kinase and ABA Receptor",100,29290610,XCorr,2.7213693,1.0000000,,,,0.0069659999571741,
DRSPLPPPR,ph,S,76,true,"Col-0 callus - FC Col-0 vs. Col-0 Xray",111a,31410901,,24.8500000,,0.2784202,0.0000000,NO,,-0.1526861
DRSPLPPPR,ph,S,76,true,"Col-0 X-ray callus - FC Col-0 vs. Col-0 Xray",111b,31410901,,24.8500000,,0.2784202,0.0000000,NO,,-0.1526861
DRSPLPPPR,ph,S,76,true,"atm callus - FC atm vs. atm Xray",111c,31410901,,24.8500000,,0.0892451,0.0000000,NO,,-0.1526861
DRSPLPPPR,ph,S,76,true,"atm-3 X-ray callus - FC atm vs. atm Xray",111d,31410901,,24.8500000,,0.0892451,0.0000000,NO,,-0.1526861
SPLPPPR,ph,S,76,true,"Phospho cell culture sucrose/TOR",109,30833711,,,1.0000000,,,,,
SPLPPPR,ph,S,76,true,"Tissue atlas Arabidopsis - ProteomicsDB",114,32188942,"MaxQuant score",185.3000000,1.0000000,,,,2.0002499656613E-11,
RRPSLSPPPPYRDR,ph,S,90,true,"srk2dei ABA signaling phopshoproteomics",83,23572148,"MASCOT Score",38.0000000,,,,,,-0.0003000
RRPSLSPPPPYRDR,ph,S,90,true,"TOR Kinase and ABA Receptor",100,29290610,XCorr,2.6327994,0.9968000,,,,0.06785000115633,
RRPSLSPPPPYR,ph,S,90,true,"STN8 phosphoproteome",38,21768351,"MASCOT Score",51.1400000,,,,,,
RRPSLSPPPPYR,ph,S,90,true,"Phosphoproteome ethylene-regulated time response",46,24043427,"MASCOT Score",39.3300000,,,,,,-19.9416000
RRPSLSPPPPYR,ph,S,90,true,"Chloroplast kinase substrates",60,19376835,"MASCOT Score",50.1400000,,,,,,0.3729850
RRPSLSPPPPYR,ph,S,90,true,"srk2dei ABA signaling phopshoproteomics",83,23572148,"MASCOT Score",46.0000000,,,,,,-0.0011000
RRPSLSPPPPYR,ph,S,90,true,"LAXIC - mannitol vs control",84b,23660473,XCorr,3.0400000,1.0000000,,,,2.5099999856337E-10,
RRPSLSPPPPYR,ph,S,90,true,"SnRK2 protein kinase substrates",85,23776212,XCorr,2.7302592,1.0000000,,,,0.0012356500374153,
RRPSLSPPPPYR,ph,S,90,true,"atm and atr DNA damage response",88,25561503,"MASCOT Score",29.0000000,1.0000000,,,,,-0.0100000
RRPSLSPPPPYR,ph,S,90,true,"TOR Kinase and ABA Receptor",100,29290610,XCorr,3.6735189,1.0000000,,,,4.7290000111389E-6,
RRPSLSPPPPYR,ph,S,90,true,"Phospho cell culture sucrose/TOR",109,30833711,,,0.9999900,,,,,
RRPSLSPPPPYR,ph,S,90,true,"Col-0 callus - FC Col-0 vs. Col-0 Xray",111a,31410901,,31.1100000,,0.0553194,0.0000000,NO,,0.1038634
RRPSLSPPPPYR,ph,S,90,true,"Col-0 X-ray callus - FC Col-0 vs. Col-0 Xray",111b,31410901,,31.1100000,,0.0553194,0.0000000,NO,,0.1038634
RRPSLSPPPPYR,ph,S,90,true,"atm callus - FC atm vs. atm Xray",111c,31410901,,31.1100000,,-0.2096620,0.0000000,NO,,0.1038634
RRPSLSPPPPYR,ph,S,90,true,"atm-3 X-ray callus - FC atm vs. atm Xray",111d,31410901,,31.1100000,,-0.2096620,0.0000000,NO,,0.1038634
RRPSLSPPPPYR,ph,S,90,true,"Touch-induced phosphorylation: 40s touch vs untouc",136,30291188,"MASCOT score",49.3200000,,0.0187652,0.8627960,NO,,4.5348139
RPSLSPPPPYR,ph,S,90,true,"Phosphoproteome ethylene-regulated time response",46,24043427,"MASCOT Score",35.8000000,,,,,,13.5959000
RPSLSPPPPYR,ph,S,90,true,"Conserved plant phosphoproteome - Arabidopsis",61a,20466843,"MASCOT Score",24.0000000,1.0000000,,,,,
RPSLSPPPPYR,ph,S,90,true,"LAXIC - mannitol vs control",84b,23660473,XCorr,3.1600000,1.0000000,,,,0.0035147999878973,
RPSLSPPPPYR,ph,S,90,true,"atm and atr DNA damage response",88,25561503,"MASCOT Score",46.0000000,1.0000000,,,,,0.6000000
RPSLSPPPPYR,ph,S,90,true,"Col-0 callus - FC Col-0 vs. Col-0 Xray",111a,31410901,,31.7500000,,0.7420096,0.0253258,YES,,0.7255252
RPSLSPPPPYR,ph,S,90,true,"Col-0 X-ray callus - FC Col-0 vs. Col-0 Xray",111b,31410901,,31.7500000,,0.7420096,0.0253258,YES,,0.7255252
RPSLSPPPPYR,ph,S,90,true,"atm callus - FC atm vs. atm Xray",111c,31410901,,31.7500000,,0.3850119,0.2650165,NO,,0.7255252
RPSLSPPPPYR,ph,S,90,true,"atm-3 X-ray callus - FC atm vs. atm Xray",111d,31410901,,31.7500000,,0.3850119,0.2650165,NO,,0.7255252
RPSLSPPPPYR,ph,S,90,true,"Tissue atlas Arabidopsis - ProteomicsDB",114,32188942,"MaxQuant score",141.7300000,1.0000000,,,,1.8979399385444E-7,
RRPSLSPPPPYRDR,ph,S,92,true,"Conserved plant phosphoproteome - Arabidopsis",61a,20466843,"MASCOT Score",27.0000000,1.0000000,,,,,
RRPSLSPPPPYRDR,ph,S,92,true,"srk2dei ABA signaling phopshoproteomics",83,23572148,"MASCOT Score",38.0000000,,,,,,-0.0003000
RRPSLSPPPPYR,ph,S,92,true,"Phosphoproteome ethylene-regulated time response",46,24043427,"MASCOT Score",39.3300000,,,,,,-19.9416000
RRPSLSPPPPYR,ph,S,92,true,"Chloroplast kinase substrates",60,19376835,"MASCOT Score",50.1400000,,,,,,0.3729850
RRPSLSPPPPYR,ph,S,92,true,"srk2dei ABA signaling phopshoproteomics",83,23572148,"MASCOT Score",46.0000000,,,,,,-0.0011000
RRPSLSPPPPYR,ph,S,92,true,"LAXIC - mannitol vs control",84b,23660473,XCorr,3.0400000,1.0000000,,,,2.5099999856337E-10,
RRPSLSPPPPYR,ph,S,92,true,"SnRK2 protein kinase substrates",85,23776212,XCorr,2.7302592,1.0000000,,,,0.0012356500374153,
RRPSLSPPPPYR,ph,S,92,true,"atm and atr DNA damage response",88,25561503,"MASCOT Score",29.0000000,1.0000000,,,,,-0.0100000
RRPSLSPPPPYR,ph,S,92,true,"TOR Kinase and ABA Receptor",100,29290610,XCorr,3.6735189,1.0000000,,,,4.7290000111389E-6,
RRPSLSPPPPYR,ph,S,92,true,"Col-0 callus - FC Col-0 vs. Col-0 Xray",111a,31410901,,31.1100000,,0.0553194,0.0000000,NO,,0.1038634
RRPSLSPPPPYR,ph,S,92,true,"Col-0 X-ray callus - FC Col-0 vs. Col-0 Xray",111b,31410901,,31.1100000,,0.0553194,0.0000000,NO,,0.1038634
RRPSLSPPPPYR,ph,S,92,true,"atm callus - FC atm vs. atm Xray",111c,31410901,,31.1100000,,-0.2096620,0.0000000,NO,,0.1038634
RRPSLSPPPPYR,ph,S,92,true,"atm-3 X-ray callus - FC atm vs. atm Xray",111d,31410901,,31.1100000,,-0.2096620,0.0000000,NO,,0.1038634
RRPSLSPPPPYR,ph,S,92,true,"Touch-induced phosphorylation: 40s touch vs untouc",136,30291188,"MASCOT score",49.3200000,,0.0187652,0.8627960,NO,,4.5348139
RPSLSPPPPYR,ph,S,92,true,"Phosphoproteome ethylene-regulated time response",46,24043427,"MASCOT Score",35.8000000,,,,,,13.5959000
RPSLSPPPPYR,ph,S,92,true,"LAXIC - mannitol vs control",84b,23660473,XCorr,3.1600000,1.0000000,,,,0.0035147999878973,
RPSLSPPPPYR,ph,S,92,true,"atm and atr DNA damage response",88,25561503,"MASCOT Score",46.0000000,1.0000000,,,,,0.6000000
RPSLSPPPPYR,ph,S,92,true,"Col-0 callus - FC Col-0 vs. Col-0 Xray",111a,31410901,,31.7500000,,0.7420096,0.0253258,YES,,0.7255252
RPSLSPPPPYR,ph,S,92,true,"Col-0 X-ray callus - FC Col-0 vs. Col-0 Xray",111b,31410901,,31.7500000,,0.7420096,0.0253258,YES,,0.7255252
RPSLSPPPPYR,ph,S,92,true,"atm callus - FC atm vs. atm Xray",111c,31410901,,31.7500000,,0.3850119,0.2650165,NO,,0.7255252
RPSLSPPPPYR,ph,S,92,true,"atm-3 X-ray callus - FC atm vs. atm Xray",111d,31410901,,31.7500000,,0.3850119,0.2650165,NO,,0.7255252
RPSLSPPPPYR,ph,S,92,true,"Tissue atlas Arabidopsis - ProteomicsDB",114,32188942,"MaxQuant score",174.7200000,1.0000000,,,,4.3090899772003E-12,
RRPSLSPPPPYRDR,ph,Y,97,true,"srk2dei ABA signaling phopshoproteomics",83,23572148,"MASCOT Score",25.0000000,,,,,,-0.0008000
RRPSLSPPPPYRDR,ph,Y,97,true,"TOR Kinase and ABA Receptor",100,29290610,XCorr,2.8833733,0.9996000,,,,0.035369999706745,
GSPRGGYGPPDR,me1,R,130,true,"Arabidopsis protein methylome",123,31809900,"MaxQuant Score",133.1500000,1.0000000,,,,5.6051938572993E-45,0.3457800
YQDWEGGRGGYGDASNSGNPQR,me1,R,178,true,"Arabidopsis protein methylome",123,31809900,"MaxQuant Score",107.3900000,1.0000000,,,,6.3892298025103E-31,-0.0018158
GGYGDASNSGNPQR,ph,S,185,true,"Tissue atlas Arabidopsis - ProteomicsDB",114,32188942,"MaxQuant score",155.6400000,0.9929890,,,,2.4259999564791E-10,
SEYITTQKR,ac,K,230,true,"Quantitative Acetylproteomics",101,29440448,,,,,,,,
SGRTSEPNSEDEAAGVGKR,ph,S,291,true,"Phosphoproteome ethylene-regulated time response",46,24043427,"MASCOT Score",36.1800000,,,,,,-0.1876200
SGRTSEPNSEDEAAGVGKR,ph,T,294,true,"SnRK2 protein kinase substrates",85,23776212,XCorr,5.0539374,0.8620000,,,,1.0970200442495E-12,
SGRTSEPNSEDEAAGVGKR,ph,T,294,true,"Tissue atlas Arabidopsis - ProteomicsDB",114,32188942,"MaxQuant score",159.7900000,0.8864270,,,,5.8685202060301E-17,
SGRTSEPNSEDEAAGVGK,ph,T,294,true,"Tyrosine phosphorylation in Arabidopsis",59,18463617,"MASCOT Score",31.0000000,,,,,,-0.5348242
SGRTSEPNSEDEAAGVGK,ph,T,294,true,"atm and atr DNA damage response",88,25561503,"MASCOT Score",26.0000000,0.9320000,,,,,0.9500000
TSEPNSEDEAAGVGK,ph,T,294,true,"STN8 phosphoproteome",38,21768351,"MASCOT Score",41.1800000,,,,,,
TSEPNSEDEAAGVGK,ph,T,294,true,"Chloroplast kinase substrates",60,19376835,"MASCOT Score",32.9000000,,,,,,-0.6172090
TSEPNSEDEAAGVGK,ph,T,294,true,"atm and atr DNA damage response",88,25561503,"MASCOT Score",33.0000000,0.9280000,,,,,0.3800000
TSEPNSEDEAAGVGK,ph,T,294,true,"Lateral root-induction - NAA vs control",106,23328941,"MASCOT Score",30.0000000,,,,,,
SGRTSEPNSEDEAAGVGKR,ph,S,295,true,"LAXIC - mannitol vs control",84b,23660473,XCorr,3.9000000,0.7510000,,,,0.00024171700351872,
SGRTSEPNSEDEAAGVGKR,ph,S,295,true,"SnRK2 protein kinase substrates",85,23776212,XCorr,4.6188359,0.8690000,,,,0.0015217399923131,
SGRTSEPNSEDEAAGVGKR,ph,S,295,true,"atm and atr DNA damage response",88,25561503,"MASCOT Score",32.0000000,0.9910000,,,,,-0.5100000
SGRTSEPNSEDEAAGVGK,ph,S,295,true,"Tyrosine phosphorylation in Arabidopsis",59,18463617,"MASCOT Score",28.0000000,,,,,,-1.3905443
SGRTSEPNSEDEAAGVGK,ph,S,295,true,"LAXIC - mannitol vs control",84b,23660473,XCorr,5.5200000,0.9480000,,,,0.00024829601170495,
SGRTSEPNSEDEAAGVGK,ph,S,295,true,"SnRK2 protein kinase substrates",85,23776212,XCorr,5.1765633,0.9980000,,,,3.2943100829706E-13,
SGRTSEPNSEDEAAGVGK,ph,S,295,true,"atm and atr DNA damage response",88,25561503,"MASCOT Score",103.0000000,0.9630000,,,,,-0.3100000
SGRTSEPNSEDEAAGVGK,ph,S,295,true,"Brassinosteroid-Regulated Phosphorylation Dynamics",94,26187819,"MaxQuant Score",214.6500000,0.9980000,,,,0,-0.0930000
SGRTSEPNSEDEAAGVGK,ph,S,295,true,"TOR Kinase and ABA Receptor",100,29290610,XCorr,6.0819221,0.9896000,,,,5.7260002295223E-10,
SGRTSEPNSEDEAAGVGK,ph,S,295,true,"Phospho cell culture sucrose/TOR",109,30833711,,,1.0000000,,,,,
SGRTSEPNSEDEAAGVGK,ph,S,295,true,"Tissue atlas Arabidopsis - ProteomicsDB",114,32188942,"MaxQuant score",256.2800000,0.9958400,,,,0,
TSEPNSEDEAAGVGKR,ph,S,295,true,"atm and atr DNA damage response",88,25561503,"MASCOT Score",66.0000000,1.0000000,,,,,-0.9800000
TSEPNSEDEAAGVGK,ph,S,295,true,"LAXIC - mannitol vs control",84b,23660473,XCorr,4.7000000,0.9410000,,,,0.00069792702561244,
TSEPNSEDEAAGVGK,ph,S,295,true,"atm and atr DNA damage response",88,25561503,"MASCOT Score",72.0000000,0.9500000,,,,,-0.8700000
TSEPNSEDEAAGVGK,ph,S,295,true,"Lateral root-induction - NAA vs control",106,23328941,"MASCOT Score",49.0000000,,,,,,
SGRTSEPNSEDEAAGVGKR,ph,S,299,true,"Phosphoproteome ethylene-regulated time response",46,24043427,"MASCOT Score",36.1800000,,,,,,-0.1876200
SGRTSEPNSEDEAAGVGKR,ph,S,299,true,"LAXIC - mannitol vs control",84b,23660473,XCorr,3.9000000,0.7510000,,,,0.00024171700351872,
SGRTSEPNSEDEAAGVGKR,ph,S,299,true,"SnRK2 protein kinase substrates",85,23776212,XCorr,5.0539374,1.0000000,,,,1.0970200442495E-12,
SGRTSEPNSEDEAAGVGKR,ph,S,299,true,"atm and atr DNA damage response",88,25561503,"MASCOT Score",32.0000000,1.0000000,,,,,-0.5100000
SGRTSEPNSEDEAAGVGK,ph,S,299,true,"srk2dei ABA signaling phopshoproteomics",83,23572148,"MASCOT Score",27.0000000,,,,,,-0.0004000
SGRTSEPNSEDEAAGVGK,ph,S,299,true,"LAXIC - mannitol vs control",84b,23660473,XCorr,5.5200000,1.0000000,,,,0.00024829601170495,
SGRTSEPNSEDEAAGVGK,ph,S,299,true,"SnRK2 protein kinase substrates",85,23776212,XCorr,5.1765633,1.0000000,,,,3.2943100829706E-13,
SGRTSEPNSEDEAAGVGK,ph,S,299,true,"atm and atr DNA damage response",88,25561503,"MASCOT Score",44.0000000,1.0000000,,,,,-0.7700000
SGRTSEPNSEDEAAGVGK,ph,S,299,true,"Brassinosteroid-Regulated Phosphorylation Dynamics",94,26187819,"MaxQuant Score",214.6500000,1.0000000,,,,0,-0.1140000
SGRTSEPNSEDEAAGVGK,ph,S,299,true,"TOR Kinase and ABA Receptor",100,29290610,XCorr,6.0819221,1.0000000,,,,5.7260002295223E-10,
TSEPNSEDEAAGVGKR,ph,S,299,true,"STN8 phosphoproteome",38,21768351,"MASCOT Score",52.3800000,,,,,,-0.0343701
TSEPNSEDEAAGVGKR,ph,S,299,true,"Chloroplast kinase substrates",60,19376835,"MASCOT Score",39.9100000,,,,,,3.5326800
TSEPNSEDEAAGVGKR,ph,S,299,true,"SnRK2 protein kinase substrates",85,23776212,XCorr,4.5484753,1.0000000,,,,0.0027602599002421,
TSEPNSEDEAAGVGKR,ph,S,299,true,"atm and atr DNA damage response",88,25561503,"MASCOT Score",66.0000000,1.0000000,,,,,-0.9800000
TSEPNSEDEAAGVGKR,ph,S,299,true,"Protein sumoylation and phosphorylation cross-talk",97,28419593,,,,,,,,
TSEPNSEDEAAGVGKR,ph,S,299,true,"Col-0 callus - FC Col-0 vs. Col-0 Xray",111a,31410901,,49.0600000,,2.1115479,0.0000000,NO,,0.2893498
TSEPNSEDEAAGVGKR,ph,S,299,true,"Col-0 X-ray callus - FC Col-0 vs. Col-0 Xray",111b,31410901,,49.0600000,,2.1115479,0.0000000,NO,,0.2893498
TSEPNSEDEAAGVGKR,ph,S,299,true,"atm callus - FC atm vs. atm Xray",111c,31410901,,49.0600000,,-0.8007733,0.0000000,NO,,0.2893498
TSEPNSEDEAAGVGKR,ph,S,299,true,"atm-3 X-ray callus - FC atm vs. atm Xray",111d,31410901,,49.0600000,,-0.8007733,0.0000000,NO,,0.2893498
TSEPNSEDEAAGVGKR,ph,S,299,true,"Tissue atlas Arabidopsis - ProteomicsDB",114,32188942,"MaxQuant score",264.8400000,1.0000000,,,,0,
TSEPNSEDEAAGVGK,ph,S,299,true,"STN8 phosphoproteome",38,21768351,"MASCOT Score",43.2600000,,,,,,-1.9154500
TSEPNSEDEAAGVGK,ph,S,299,true,"Large-scale phosphorylation discovery",44,23111157,XCorr,2.9780000,,,,,,
TSEPNSEDEAAGVGK,ph,S,299,true,"Tyrosine phosphorylation in Arabidopsis",59,18463617,"MASCOT Score",49.0000000,,,,,,-0.8919367
TSEPNSEDEAAGVGK,ph,S,299,true,"Chloroplast kinase substrates",60,19376835,"MASCOT Score",43.0700000,,,,,,0.2479060
TSEPNSEDEAAGVGK,ph,S,299,true,"Conserved plant phosphoproteome - Arabidopsis",61a,20466843,"MASCOT Score",49.0000000,1.0000000,,,,,
TSEPNSEDEAAGVGK,ph,S,299,true,"LAXIC - mannitol vs control",84b,23660473,XCorr,4.7000000,1.0000000,,,,0.00069792702561244,
TSEPNSEDEAAGVGK,ph,S,299,true,"SnRK2 protein kinase substrates",85,23776212,XCorr,4.5060506,0.9700000,,,,0.0033040300477296,
TSEPNSEDEAAGVGK,ph,S,299,true,"atm and atr DNA damage response",88,25561503,"MASCOT Score",110.0000000,1.0000000,,,,,-1.0300000
TSEPNSEDEAAGVGK,ph,S,299,true,"TOR Kinase and ABA Receptor",100,29290610,XCorr,4.2219872,1.0000000,,,,2.7939999199589E-5,
TSEPNSEDEAAGVGK,ph,S,299,true,"Lateral root-induction - NAA vs control",106,23328941,"MASCOT Score",49.0000000,,,,,,
STGPVVIIR,nt,S,381,true,"N-terminal ChaFRADIC",92,26010716,"MASCOT Score",57.5900000,,,,,0.056189998984337,
RKPSMENR,ph,S,571,true,"TOR Kinase and ABA Receptor",100,29290610,XCorr,2.5580251,1.0000000,,,,0.005392000079155,
DPSGPNPPFEGSGR,ph,S,678,true,"Tissue atlas Arabidopsis - ProteomicsDB",114,32188942,"MaxQuant score",123.7600000,1.0000000,,,,3.7686699215556E-5,
DPSGPNPPFEGSGRGGPAPFLLSPAFR,me1,R,680,true,"Arabidopsis protein methylome",123,31809900,"MaxQuant Score",157.6800000,1.0000000,,,,0,-0.3210500
DPSGPNPPFEGSGRGGPAPFLLSPAFR,me2,R,680,true,"Arabidopsis protein methylome",123,31809900,"MaxQuant Score",127.5300000,1.0000000,,,,5.6051938572993E-45,4.4031000
GGPAPFLLSPAFR,ph,S,689,true,"Arabidopsis root NAA phosphoproteome",18a,27643528,"MaxQuant Score",50.3050000,1.0000000,,,,0.00042999998549931,-0.8590000
GGPAPFLLSPAFR,ph,S,689,true,"MAPK Arabidopsis substrates",45,23172892,"MaxQuant Score",184.3100000,,,,,,
GGPAPFLLSPAFR,ph,S,689,true,"TOR Kinase and ABA Receptor",100,29290610,XCorr,4.2418261,1.0000000,,,,1.1479999557196E-5,
GGPAPFLLSPAFR,ph,S,689,true,"Lateral root-induction - NAA vs control",106,23328941,"MASCOT Score",26.0000000,,0.3820369,0.1346940,NO,,
GGPAPFLLSPAFR,ph,S,689,true,"Phospho cell culture sucrose/TOR",109,30833711,,,1.0000000,,,,,
GGPAPFLLSPAFR,ph,S,689,true,"Tissue atlas Arabidopsis - ProteomicsDB",114,32188942,"MaxQuant score",136.3000000,1.0000000,,,,3.4813998354366E-5,