Peptide,PTM,ModifiedAA,ModifiedPosition,PeptideUniqueToGene,ExperimentDesc,ExpID,PubmedID,ScoreType,IdentScore,LocProb,Log2FChange,PQ-val,QuantSig,PEP,MassErrorPPM
ANGNGSPNGNESPSDGDRK,ph,S,166,true,"atm and atr DNA damage response",88,25561503,"MASCOT Score",46.0000000,1.0000000,,,,,-1.0000000
ANGNGSPNGNESPSDGDR,ph,S,166,true,"SnRK2 protein kinase substrates",85,23776212,XCorr,2.8590324,1.0000000,,,,0.0012170099653304,
ANGNGSPNGNESPSDGDR,ph,S,166,true,"atm and atr DNA damage response",88,25561503,"MASCOT Score",71.0000000,1.0000000,,,,,-0.5600000
ANGNGSPNGNESPSDGDR,ph,S,166,true,"Tissue atlas Arabidopsis - ProteomicsDB",114,32188942,"MaxQuant score",345.0200000,1.0000000,,,,0,
ANGNGSPNGNESPSDGDRK,ph,S,172,true,"atm and atr DNA damage response",88,25561503,"MASCOT Score",46.0000000,1.0000000,,,,,-1.0000000
ANGNGSPNGNESPSDGDR,ph,S,172,true,"SnRK2 protein kinase substrates",85,23776212,XCorr,2.8590324,0.9790000,,,,0.0012170099653304,
ANGNGSPNGNESPSDGDR,ph,S,172,true,"atm and atr DNA damage response",88,25561503,"MASCOT Score",83.0000000,0.9280000,,,,,-0.1300000
ANGNGSPNGNESPSDGDR,ph,S,172,true,"Tissue atlas Arabidopsis - ProteomicsDB",114,32188942,"MaxQuant score",345.0200000,0.9999380,,,,0,
ANGNGSPNGNESPSDGDR,ph,S,174,true,"atm and atr DNA damage response",88,25561503,"MASCOT Score",71.0000000,0.9920000,,,,,-0.5600000
QGCLLVR,so,C,237,false,"S-sulfenylation site detection using YAP1C",110,32714340,,,,,,,,
SCGISISSNFTQVEGR,so,C,457,true,"Arabidopsis S-sulfenylation chemoproteomics",108,31578252,"pFind PSM Score",0.0002261,,,,,,-1.1650442
FEDQSETSSSHGGITAPGPISVAQLPR,ph,S,890,true,"srk2dei ABA signaling phopshoproteomics",83,23572148,"MASCOT Score",33.0000000,,,,,,-0.0003000
FEDQSETSSSHGGITAPGPISVAQLPR,ph,S,890,true,"Brassinosteroid-Regulated Phosphorylation Dynamics",94,26187819,"MaxQuant Score",133.1000000,0.9050000,,,,6.5969999645324E-13,0.8560000
FEDQSETSSSHGGITAPGPISVAQLPR,ph,S,890,true,"Phospho cell culture sucrose/TOR",109,30833711,,,0.8610090,,,,,
FEDQSETSSSHGGITAPGPISVAQLPR,ph,S,890,true,"Tissue atlas Arabidopsis - ProteomicsDB",114,32188942,"MaxQuant score",234.3900000,0.9919790,,,,0,
FEDQSETSSSHGGITAPGPISVAQLPR,ph,T,892,true,"Large-scale phosphorylation discovery",44,23111157,XCorr,6.1840000,,,,,,
FEDQSETSSSHGGITAPGPISVAQLPR,ph,T,892,true,"srk2dei ABA signaling phopshoproteomics",83,23572148,"MASCOT Score",33.0000000,,,,,,-0.0003000
FEDQSETSSSHGGITAPGPISVAQLPR,ph,T,892,true,"SnRK2 protein kinase substrates",85,23776212,XCorr,4.3065944,0.8000000,,,,5.62646995661E-8,
FEDQSETSSSHGGITAPGPISVAQLPR,ph,T,892,true,"Brassinosteroid-Regulated Phosphorylation Dynamics",94,26187819,"MaxQuant Score",126.0400000,0.8210000,,,,1.4759999862959E-12,1.0660000
FEDQSETSSSHGGITAPGPISVAQLPR,ph,S,893,true,"srk2dei ABA signaling phopshoproteomics",83,23572148,"MASCOT Score",61.0000000,,,,,,0.0000000
FEDQSETSSSHGGITAPGPISVAQLPR,ph,S,893,true,"Col-0 callus - FC Col-0 vs. Col-0 Xray",111a,31410901,,42.5100000,,1.1150458,0.0236316,YES,,0.9221929
FEDQSETSSSHGGITAPGPISVAQLPR,ph,S,893,true,"Col-0 X-ray callus - FC Col-0 vs. Col-0 Xray",111b,31410901,,42.5100000,,1.1150458,0.0236316,YES,,0.9221929
FEDQSETSSSHGGITAPGPISVAQLPR,ph,S,893,true,"atm callus - FC atm vs. atm Xray",111c,31410901,,42.5100000,,1.3305618,0.0065302,YES,,0.9221929
FEDQSETSSSHGGITAPGPISVAQLPR,ph,S,893,true,"atm-3 X-ray callus - FC atm vs. atm Xray",111d,31410901,,42.5100000,,1.3305618,0.0065302,YES,,0.9221929
FEDQSETSSSHGGITAPGPISVAQLPR,ph,S,894,true,"Large-scale phosphorylation discovery",44,23111157,XCorr,3.8910000,,,,,,
FEDQSETSSSHGGITAPGPISVAQLPR,ph,S,894,true,"PAMP-triggered phosphorylation",48,24601666,"MASCOT Score",37.8200000,,,,,,
FEDQSETSSSHGGITAPGPISVAQLPR,ph,S,894,true,"srk2dei ABA signaling phopshoproteomics",83,23572148,"MASCOT Score",63.0000000,,,,,,-0.0008000
FEDQSETSSSHGGITAPGPISVAQLPR,ph,S,894,true,"Lateral root-induction - NAA vs control",106,23328941,"MASCOT Score",48.0000000,,,,,,
FEDQSETSSSHGGITAPGPISVAQLPR,ph,S,894,true,"Col-0 callus - FC Col-0 vs. Col-0 Xray",111a,31410901,,42.5100000,,1.1150458,0.0236316,YES,,0.9221929
FEDQSETSSSHGGITAPGPISVAQLPR,ph,S,894,true,"Col-0 X-ray callus - FC Col-0 vs. Col-0 Xray",111b,31410901,,42.5100000,,1.1150458,0.0236316,YES,,0.9221929
FEDQSETSSSHGGITAPGPISVAQLPR,ph,S,894,true,"atm callus - FC atm vs. atm Xray",111c,31410901,,42.5100000,,1.3305618,0.0065302,YES,,0.9221929
FEDQSETSSSHGGITAPGPISVAQLPR,ph,S,894,true,"atm-3 X-ray callus - FC atm vs. atm Xray",111d,31410901,,42.5100000,,1.3305618,0.0065302,YES,,0.9221929
FEDQSETSSSHGGITAPGPISVAQLPR,ph,S,894,true,"Tissue atlas Arabidopsis - ProteomicsDB",114,32188942,"MaxQuant score",274.1200000,0.7894500,,,,0,
FEDQSETSSSHGGITAPGPISVAQLPR,ph,S,895,true,"Large-scale phosphorylation discovery",44,23111157,XCorr,4.2820000,,,,,,
FEDQSETSSSHGGITAPGPISVAQLPR,ph,S,895,true,"PAMP-triggered phosphorylation",48,24601666,"MASCOT Score",23.6700000,,,,,,
FEDQSETSSSHGGITAPGPISVAQLPR,ph,S,895,true,"srk2dei ABA signaling phopshoproteomics",83,23572148,"MASCOT Score",63.0000000,,,,,,-0.0008000
FEDQSETSSSHGGITAPGPISVAQLPR,ph,S,895,true,"Lateral root-induction - NAA vs control",106,23328941,"MASCOT Score",48.0000000,,,,,,
FEDQSETSSSHGGITAPGPISVAQLPR,ph,T,900,true,"srk2dei ABA signaling phopshoproteomics",83,23572148,"MASCOT Score",24.0000000,,,,,,-0.0001000
FEDQSETSSSHGGITAPGPISVAQLPR,ph,T,900,true,"Lateral root-induction - NAA vs control",106,23328941,"MASCOT Score",26.0000000,,,,,,
LKDNVANSMFFC,ox,C,924,true,"SPEAR - 10 mM H2O2 / mock",138a,34619326,,,,1.0538198,0.0266780,YES,,
LKDNVANSMFFC,ox,C,924,true,"SPEAR - 50 mM H2O2 / mock",138b,34619326,,,,1.0464715,0.0038744,YES,,
