Peptide,PTM,ModifiedAA,ModifiedPosition,PeptideUniqueToGene,ExperimentDesc,ExpID,PubmedID,ScoreType,IdentScore,LocProb,Log2FChange,PQ-val,QuantSig,PEP,MassErrorPPM
LTGSIPPELGNMSK,ng,N,329,true,"Conserved N-glycosylation",74,22633491,"MaxQuant Score",93.3640000,1.0000000,,,,1.9740000425372E-6,0.1860000
LESMTYLNLSSNNIK,ng,N,409,true,"Conserved N-glycosylation",74,22633491,"MaxQuant Score",155.0900000,1.0000000,,,,9.7750002566922E-29,1.4560000
CVLKNCKPVAIKR,ub,K,668,true,"Ubiquitination Membrane Proteins",120,33585938,,,,,,,,
LYSHNPQSMK,ph,S,680,true,"Tissue atlas Arabidopsis - ProteomicsDB",114,32188942,"MaxQuant score",99.7320000,0.9999980,,,,0.0004407060041558,
TPHSVNCSSMSASDAQLFLR,fuc,S,954,true,"SPINDLY O-fucosylation",162,36739885,,,,,,,-0.041000001132488,
FGQVISQNSE,ph,S,972,true,"atm and atr DNA damage response",88,25561503,"MASCOT Score",24.0000000,1.0000000,,,,,-0.0900000
FGQVISQNSE,ph,S,975,true,"atm and atr DNA damage response",88,25561503,"MASCOT Score",57.0000000,0.9980000,,,,,0.6600000
FGQVISQNSE,ph,S,975,true,"Tissue atlas Arabidopsis - ProteomicsDB",114,32188942,"MaxQuant score",174.0500000,0.9999960,,,,7.3518799581507E-7,
