Peptide,PTM,ModifiedAA,ModifiedPosition,PeptideUniqueToGene,ExperimentDesc,ExpID,PubmedID,ScoreType,IdentScore,LocProb,Log2FChange,PQ-val,QuantSig,PEP,MassErrorPPM
GRSNEQDLLSTEIVNR,ph,S,4,true,"atm and atr DNA damage response",88,25561503,"MASCOT Score",62.0000000,1.0000000,,,,,-0.4600000
GRSNEQDLLSTEIVNR,ph,S,4,true,"Tissue atlas Arabidopsis - ProteomicsDB",114,32188942,"MaxQuant score",149.3000000,1.0000000,,,,7.3234002195832E-10,
GIEPSGPNAGSPTFSVR,nt,G,18,true,"Metacaspase9 substrates - Col-0 / mc9",51a,23964026,"MASCOT Score",66.0000000,,1.5870235,,NO,,-3.1502695
GIEPSGPNAGSPTFSVR,nt,G,18,true,"Metacaspase9 substrates - 35S:MC9 / mc9",51b,23964026,"MASCOT Score",53.0000000,,2.3874126,,NO,,-3.0357145
GIEPSGPNAGSPTFSVR,nt,G,18,true,"HUNTER N-terminome: legumain, GluC and trypsin",119,31951383,"MaxQuant score",105.9500000,,,,,,
GIEPSGPNAGSPTFSVR,ph,S,28,true,"Large-scale phosphorylation discovery",44,23111157,XCorr,3.6420000,,,,,,
GIEPSGPNAGSPTFSVR,ph,S,28,true,"TOR Kinase and ABA Receptor",100,29290610,XCorr,4.2043362,0.9883000,,,,6.2370003433898E-5,
GIEPSGPNAGSPTFSVR,ph,S,28,true,"Tissue atlas Arabidopsis - ProteomicsDB",114,32188942,"MaxQuant score",189.5600000,0.9913520,,,,5.9716698394803E-39,
KSGKFDEETLGFK,ph,S,149,true,"Tissue atlas Arabidopsis - ProteomicsDB",114,32188942,"MaxQuant score",78.5540000,0.9999750,,,,0.00037956799496897,
SISSSENITTMK,ng,N,184,true,"Conserved N-glycosylation",74,22633491,"MaxQuant Score",97.4650000,1.0000000,,,,7.9040000855457E-5,0.2510000
SISSSENITTMKEGR,ub,K,189,true,"upl3 mutant / wildtype",168,35926874,"MaxQuant score",125.5000000,1.0000000,-0.1140352,0.8935600,NO,1.7238500404915E-8,0.3158100
MGCSAVMLSNR,acy,C,310,true,"Arabidopsis S-acylation atlas - Silique",163e,35681017,,,,,,,,
TSTTTSFSTSATAK,ph,S,413,true,"Tissue atlas Arabidopsis - ProteomicsDB",114,32188942,"MaxQuant score",97.4500000,0.8978430,,,,0.00014759499754291,
TSTTTSFSTSATAKTNGIK,ub,K,421,true,"Ubiquitination Membrane Proteins",120,33585938,,,,,,,,
SSSSDLSKPYIPDYK,ph,S,428,true,"atm and atr DNA damage response",88,25561503,"MASCOT Score",31.0000000,0.8470000,,,,,-0.3500000
SSSSDLSK,ph,S,428,true,"atm and atr DNA damage response",88,25561503,"MASCOT Score",34.0000000,0.9540000,,,,,-1.0900000
SSSSDLSKPYIPDYK,ph,S,429,true,"atm and atr DNA damage response",88,25561503,"MASCOT Score",29.0000000,0.9860000,,,,,-0.6000000
SSSSDLSKPYIPDYK,ph,S,429,true,"Tissue atlas Arabidopsis - ProteomicsDB",114,32188942,"MaxQuant score",238.8300000,0.9801620,,,,0,
SSSSDLSKPYIPDYK,ph,S,430,true,"Tissue atlas Arabidopsis - ProteomicsDB",114,32188942,"MaxQuant score",268.0800000,0.9861770,,,,0,
