Peptide,PTM,ModifiedAA,ModifiedPosition,PeptideUniqueToGene,ExperimentDesc,ExpID,PubmedID,ScoreType,IdentScore,LocProb,Log2FChange,PQ-val,QuantSig,PEP,MassErrorPPM
MDKETEILSR,nta,M,1,true,"Arg/N-end rule seed, prt6 vs. Wt",99,29168982,"MASCOT Score",23.0200000,,-0.4145808,0.0156435,NO,0.18999999761581,-1.4979846
IKEDEESEDENSGLGNCLR,ph,S,120,true,"Tissue atlas Arabidopsis - ProteomicsDB",114,32188942,"MaxQuant score",139.7000000,0.9999990,,,,2.0708299610956E-15,
SNTPGLDPGDLGTEGEK,ph,T,654,true,"Tissue atlas Arabidopsis - ProteomicsDB",114,32188942,"MaxQuant score",136.8800000,0.9805860,,,,9.7333097137664E-10,
VLSPSIEAKPNCYVR,ph,S,1119,true,"Tissue atlas Arabidopsis - ProteomicsDB",114,32188942,"MaxQuant score",163.6200000,0.9999920,,,,1.5574799479626E-12,
VSEFVVTPK,ph,T,1229,true,"atm and atr DNA damage response",88,25561503,"MASCOT Score",46.0000000,1.0000000,,,,,-2.4300000
VSEFVVTPK,ph,T,1229,true,"TOR Kinase and ABA Receptor",100,29290610,XCorr,3.0308952,1.0000000,,,,0.0059799998998642,
VSEFVVTPK,ph,T,1229,true,"Tissue atlas Arabidopsis - ProteomicsDB",114,32188942,"MaxQuant score",176.4200000,1.0000000,,,,3.6212299164617E-5,
RLLEHDSDSESDTEETFSK,ph,S,1255,true,"TOR Kinase and ABA Receptor",100,29290610,XCorr,3.8536463,0.9741000,,,,0.02343999966979,
LLEHDSDSESDTEETFSK,ph,S,1255,true,"atm and atr DNA damage response",88,25561503,"MASCOT Score",53.0000000,1.0000000,,,,,-0.1500000
LLEHDSDSESDTEETFSK,ph,S,1255,true,"Tissue atlas Arabidopsis - ProteomicsDB",114,32188942,"MaxQuant score",132.7400000,1.0000000,,,,1.6533999507614E-21,
LLEHDSDSESDTEETFSK,ph,S,1257,true,"LAXIC - mannitol vs control",84b,23660473,XCorr,2.8800000,0.9740000,,,,0.00237678992562,
LLEHDSDSESDTEETFSK,ph,S,1257,true,"atm and atr DNA damage response",88,25561503,"MASCOT Score",53.0000000,1.0000000,,,,,-0.1500000
LLEHDSDSESDTEETFSK,ph,S,1257,true,"Tissue atlas Arabidopsis - ProteomicsDB",114,32188942,"MaxQuant score",132.7400000,0.9999970,,,,1.6533999507614E-21,
RLLEHDSDSESDTEETFSK,ph,S,1259,true,"TOR Kinase and ABA Receptor",100,29290610,XCorr,3.8536463,0.8690000,,,,0.02343999966979,
LLEHDSDSESDTEETFSK,ph,S,1259,true,"LAXIC - mannitol vs control",84b,23660473,XCorr,2.8800000,0.9940000,,,,0.00237678992562,
LLEHDSDSESDTEETFSK,ph,S,1259,true,"atm and atr DNA damage response",88,25561503,"MASCOT Score",53.0000000,1.0000000,,,,,-0.1500000
RLLEHDSDSESDTEETFSK,ph,T,1261,true,"TOR Kinase and ABA Receptor",100,29290610,XCorr,3.8536463,0.8669000,,,,0.02343999966979,
NNIQPALTDGSAR,ph,S,1278,true,"Tissue atlas Arabidopsis - ProteomicsDB",114,32188942,"MaxQuant score",146.5900000,0.9871980,,,,1.0941199661829E-6,
ITVSASR,ph,S,1641,true,"Tissue atlas Arabidopsis - ProteomicsDB",114,32188942,"MaxQuant score",91.0870000,0.9516200,,,,0.0049104900099337,
ITVSASRLR,ph,S,1643,true,"Tissue atlas Arabidopsis - ProteomicsDB",114,32188942,"MaxQuant score",99.4390000,0.9661650,,,,0.0022816299460828,
ASFTSSLSNFQR,ph,S,1658,true,"Tissue atlas Arabidopsis - ProteomicsDB",114,32188942,"MaxQuant score",188.1500000,0.9383130,,,,1.7470300106364E-20,
ASFTSSLSNFQR,ph,S,1661,true,"Tissue atlas Arabidopsis - ProteomicsDB",114,32188942,"MaxQuant score",170.4000000,0.7825690,,,,9.8506602926192E-15,
ASFTSSLSNFQR,ph,S,1662,true,"Tissue atlas Arabidopsis - ProteomicsDB",114,32188942,"MaxQuant score",221.7500000,0.9868000,,,,2.1515004127827E-39,
ASFTSSLSNFQR,ph,S,1664,true,"STN8 phosphoproteome",38,21768351,"MASCOT Score",47.2100000,,,,,,-0.8406000
ASFTSSLSNFQR,ph,S,1664,true,"atm and atr DNA damage response",88,25561503,"MASCOT Score",72.0000000,0.9980000,,,,,0.6300000
ASFTSSLSNFQR,ph,S,1664,true,"TOR Kinase and ABA Receptor",100,29290610,XCorr,4.0712252,0.9927000,,,,2.6530000468483E-5,
ASFTSSLSNFQR,ph,S,1664,true,"Tissue atlas Arabidopsis - ProteomicsDB",114,32188942,"MaxQuant score",202.2900000,0.9896490,,,,1.1851199568437E-30,
RAFSWAPR,ph,S,1675,true,"atm and atr DNA damage response",88,25561503,"MASCOT Score",40.0000000,1.0000000,,,,,-0.0300000
RAFSWAPR,ph,S,1675,true,"Tissue atlas Arabidopsis - ProteomicsDB",114,32188942,"MaxQuant score",118.3300000,1.0000000,,,,0.0047640497796237,
AFSWAPR,ph,S,1675,true,"TOR Kinase and ABA Receptor",100,29290610,XCorr,2.7692060,1.0000000,,,,0.0073850001208484,
RKNSGLGASER,ph,S,1697,true,"TOR Kinase and ABA Receptor",100,29290610,XCorr,2.8466804,1.0000000,,,,0.0033559999428689,
KNSGLGASER,ph,S,1697,true,"atm and atr DNA damage response",88,25561503,"MASCOT Score",45.0000000,1.0000000,,,,,-1.7500000
KNSGLGASER,ph,S,1697,true,"Tissue atlas Arabidopsis - ProteomicsDB",114,32188942,"MaxQuant score",83.2430000,0.9999920,,,,0.0017127000028268,
