Peptide,PTM,ModifiedAA,ModifiedPosition,PeptideUniqueToGene,ExperimentDesc,ExpID,PubmedID,ScoreType,IdentScore,LocProb,Log2FChange,PQ-val,QuantSig,PEP,MassErrorPPM
VASNMAPDLEVAIVK,ph,S,25,false,"Tissue atlas Arabidopsis - ProteomicsDB",114,32188942,"MaxQuant score",111.3400000,1.0000000,,,,1.6259899666693E-6,
DEAHSSSWDHSAFVR,ph,S,129,false,"Tissue atlas Arabidopsis - ProteomicsDB",114,32188942,"MaxQuant score",218.1400000,0.9805680,,,,0,
SGVSVNSGGNSSHHSNNDDRYGR,ph,S,164,true,"TOR Kinase and ABA Receptor",100,29290610,XCorr,3.8638144,0.7614000,,,,0.020369999110699,
KSGVSVNSGGNSSHHSNNDDR,ph,S,164,true,"Tissue atlas Arabidopsis - ProteomicsDB",114,32188942,"MaxQuant score",145.8100000,0.9998700,,,,1.5752599727721E-24,
SGVSVNSGGNSSHHSNNDDR,ph,S,164,true,"TOR Kinase and ABA Receptor",100,29290610,XCorr,2.8068810,0.9392000,,,,0.00087709998479113,
SGVSVNSGGNSSHHSNNDDRYGR,ph,S,168,true,"TOR Kinase and ABA Receptor",100,29290610,XCorr,3.4009187,0.8871000,,,,6.1480001022574E-5,
SGVSVNSGGNSSHHSNNDDR,ph,S,168,true,"atm and atr DNA damage response",88,25561503,"MASCOT Score",51.0000000,0.9950000,,,,,0.4400000
SGVSVNSGGNSSHHSNNDDR,ph,S,168,true,"Tissue atlas Arabidopsis - ProteomicsDB",114,32188942,"MaxQuant score",174.1900000,0.9749270,,,,0,
KSGVSVNSGGNSSHHSNNDDR,ph,S,169,true,"Tissue atlas Arabidopsis - ProteomicsDB",114,32188942,"MaxQuant score",147.2600000,0.8707740,,,,1.5523199962558E-24,
SGVSVNSGGNSSHHSNNDDR,ph,S,169,true,"atm and atr DNA damage response",88,25561503,"MASCOT Score",26.0000000,0.9990000,,,,,-1.2100000
SGVSVNSGGNSSHHSNNDDRYGR,ph,S,172,true,"TOR Kinase and ABA Receptor",100,29290610,XCorr,3.8638144,0.9985000,,,,0.020369999110699,
SGVSVNSGGNSSHHSNNDDR,ph,S,172,true,"Tissue atlas Arabidopsis - ProteomicsDB",114,32188942,"MaxQuant score",60.1390000,0.7635640,,,,1.4985799680289E-5,
GRDDFRSPPPR,ph,S,187,true,"srk2dei ABA signaling phopshoproteomics",83,23572148,"MASCOT Score",40.0000000,,,,,,-0.0013000
GRDDFRSPPPR,ph,S,187,true,"TOR Kinase and ABA Receptor",100,29290610,XCorr,3.4911034,1.0000000,,,,0.012419999577105,
GRDDFRSPPPR,ph,S,187,true,"Phospho cell culture sucrose/TOR",109,30833711,,,1.0000000,,,,,
GRDDFRSPPPR,ph,S,187,true,"Tissue atlas Arabidopsis - ProteomicsDB",114,32188942,"MaxQuant score",153.1100000,1.0000000,,,,1.4206199772104E-8,
DDFRSPPPR,ph,S,187,false,"atm and atr DNA damage response",88,25561503,"MASCOT Score",30.0000000,1.0000000,,,,,0.5800000
DDFRSPPPR,ph,S,187,false,"Tissue atlas Arabidopsis - ProteomicsDB",114,32188942,"MaxQuant score",162.6400000,1.0000000,,,,2.5463499364609E-11,
SYDYENGGGGGSDFR,ph,S,192,true,"Tissue atlas Arabidopsis - ProteomicsDB",114,32188942,"MaxQuant score",115.6800000,0.9838760,,,,4.3042400648119E-6,
SRSYGDMTEMGGGGGGGGR,ph,S,219,true,"Large-scale phosphorylation discovery",44,23111157,XCorr,3.9240000,,,,,,
SRSYGDMTEMGGGGGGGGRDEK,ph,S,221,true,"Arabidopsis root NAA phosphoproteome",18a,27643528,"MaxQuant Score",87.0520000,0.9170000,,,,4.1249998972148E-9,-0.8220000
SRSYGDMTEMGGGGGGGGRDEK,ph,S,221,true,"Phosphorylation Early Elicitor Signaling",23,17317660,,,,,,,,
SRSYGDMTEMGGGGGGGGRDEK,ph,S,221,true,"STN8 phosphoproteome",38,21768351,"MASCOT Score",44.3200000,,,,,,
SRSYGDMTEMGGGGGGGGRDEK,ph,S,221,true,"SnRK2 protein kinase substrates",85,23776212,XCorr,3.6665087,0.8150000,,,,0.012507099658251,
SRSYGDMTEMGGGGGGGGRDEK,ph,S,221,true,"atm and atr DNA damage response",88,25561503,"MASCOT Score",68.0000000,0.9880000,,,,,-0.0300000
SRSYGDMTEMGGGGGGGGRDEK,ph,S,221,true,"TOR Kinase and ABA Receptor",100,29290610,XCorr,4.8426561,0.8918000,,,,4.288000127417E-6,
SYGDMTEMGGGGGGGGRDEK,ph,S,221,true,"Phosphorylation Early Elicitor Signaling",23,17317660,,,,,,,,
SYGDMTEMGGGGGGGGRDEK,ph,S,221,true,"STN8 phosphoproteome",38,21768351,"MASCOT Score",47.2100000,,,,,,
SYGDMTEMGGGGGGGGRDEK,ph,S,221,true,"Tyrosine phosphorylation in Arabidopsis",59,18463617,"MASCOT Score",65.0000000,,,,,,-0.6510652
SYGDMTEMGGGGGGGGRDEK,ph,S,221,true,"Conserved plant phosphoproteome - Arabidopsis",61a,20466843,"MASCOT Score",63.0000000,1.0000000,,,,,
SYGDMTEMGGGGGGGGRDEK,ph,S,221,true,"srk2dei ABA signaling phopshoproteomics",83,23572148,"MASCOT Score",73.0000000,,,,,,0.0002000
SYGDMTEMGGGGGGGGRDEK,ph,S,221,true,"SnRK2 protein kinase substrates",85,23776212,XCorr,2.2368469,0.7790000,,,,0.001218460034579,
SYGDMTEMGGGGGGGGRDEK,ph,S,221,true,"atm and atr DNA damage response",88,25561503,"MASCOT Score",59.0000000,0.9340000,,,,,0.3600000
SYGDMTEMGGGGGGGGRDEK,ph,S,221,true,"TOR Kinase and ABA Receptor",100,29290610,XCorr,3.0353627,0.8721000,,,,0.093889996409416,
SRSYGDMTEMGGGGGGGGR,ph,S,221,true,"Phosphorylation Early Elicitor Signaling",23,17317660,,,,,,,,
SRSYGDMTEMGGGGGGGGR,ph,S,221,true,"atm and atr DNA damage response",88,25561503,"MASCOT Score",89.0000000,0.9320000,,,,,0.0500000
SYGDMTEMGGGGGGGGR,ph,S,221,true,"Phosphorylation Early Elicitor Signaling",23,17317660,,,,,,,,
SYGDMTEMGGGGGGGGR,ph,S,221,true,"Tyrosine phosphorylation in Arabidopsis",59,18463617,"MASCOT Score",83.0000000,,,,,,-0.5539949
SYGDMTEMGGGGGGGGR,ph,S,221,true,"srk2dei ABA signaling phopshoproteomics",83,23572148,"MASCOT Score",61.0000000,,,,,,-0.0002000
SYGDMTEMGGGGGGGGR,ph,S,221,true,"atm and atr DNA damage response",88,25561503,"MASCOT Score",89.0000000,0.9930000,,,,,-0.2300000
SYGDMTEMGGGGGGGGR,ph,S,221,true,"TOR Kinase and ABA Receptor",100,29290610,XCorr,4.7743812,0.9045000,,,,3.4839999329961E-7,
SYGDMTEMGGGGGGGGR,ph,S,221,true,"Lateral root-induction - NAA vs control",106,23328941,"MASCOT Score",93.0000000,,,,,,
SYGDMTEMGGGGGGGGR,ph,S,221,true,"Phospho cell culture sucrose/TOR",109,30833711,,,0.9989580,,,,,
SYGDMTEMGGGGGGGGR,ph,S,221,true,"Tissue atlas Arabidopsis - ProteomicsDB",114,32188942,"MaxQuant score",276.2000000,1.0000000,,,,0,
SYGDMTEMGGGGGGGGRDEK,ph,Y,222,true,"TOR Kinase and ABA Receptor",100,29290610,XCorr,2.1856914,0.8233000,,,,0.057610001415014,
SRSYGDMTEMGGGGGGGGR,ph,Y,222,true,"Large-scale phosphorylation discovery",44,23111157,XCorr,3.0790000,,,,,,
SYGDMTEMGGGGGGGGRDEK,ph,T,226,true,"srk2dei ABA signaling phopshoproteomics",83,23572148,"MASCOT Score",55.0000000,,,,,,-0.0004000
KVVTPLREMTPER,ph,T,244,true,"PAMP-triggered phosphorylation",48,24601666,"MASCOT Score",31.5500000,,,,,,
KVVTPLREMTPER,ph,T,244,true,"srk2dei ABA signaling phopshoproteomics",83,23572148,"MASCOT Score",32.0000000,,,,,,0.0009000
KVVTPLREMTPER,ph,T,244,true,"SnRK2 protein kinase substrates",85,23776212,XCorr,2.6602340,1.0000000,,,,0.0018151300027966,
KVVTPLREMTPER,ph,T,244,true,"TOR Kinase and ABA Receptor",100,29290610,XCorr,2.7314422,1.0000000,,,,0.0013379999436438,
KVVTPLREMTPER,ph,T,244,true,"Tissue atlas Arabidopsis - ProteomicsDB",114,32188942,"MaxQuant score",193.0100000,1.0000000,,,,1.8379500588139E-8,
KVVTPLR,ph,T,244,true,"Phosphorylation Early Elicitor Signaling",23,17317660,,,,,,,,
KVVTPLR,ph,T,244,true,"STN8 phosphoproteome",38,21768351,"MASCOT Score",47.7200000,,,,,,-0.6070250
KVVTPLR,ph,T,244,true,"Chloroplast kinase substrates",60,19376835,"MASCOT Score",48.1400000,,,,,,-0.6070250
KVVTPLR,ph,T,244,true,"LAXIC - mannitol vs control",84b,23660473,XCorr,2.6300000,1.0000000,,,,0.009495030157268,
KVVTPLR,ph,T,244,true,"SnRK2 protein kinase substrates",85,23776212,XCorr,2.9128888,1.0000000,,,,0.0032281000167131,
KVVTPLR,ph,T,244,true,"TOR Kinase and ABA Receptor",100,29290610,XCorr,2.9808397,1.0000000,,,,0.00045520000276156,
KVVTPLR,ph,T,244,true,"Col-0 callus - FC Col-0 vs. Col-0 Xray",111a,31410901,,24.9700000,,-2.3727199,0.0000000,NO,,-0.0263286
KVVTPLR,ph,T,244,true,"Col-0 X-ray callus - FC Col-0 vs. Col-0 Xray",111b,31410901,,24.9700000,,-2.3727199,0.0000000,NO,,-0.0263286
KVVTPLR,ph,T,244,true,"atm callus - FC atm vs. atm Xray",111c,31410901,,24.9700000,,0.2702781,0.0000000,NO,,-0.0263286
KVVTPLR,ph,T,244,true,"atm-3 X-ray callus - FC atm vs. atm Xray",111d,31410901,,24.9700000,,0.2702781,0.0000000,NO,,-0.0263286
VVTPLR,ph,T,244,true,"Phosphorylation Early Elicitor Signaling",23,17317660,,,,,,,,
VVTPLR,ph,T,244,true,"TOR Kinase and ABA Receptor",100,29290610,XCorr,2.1020212,1.0000000,,,,0.044360000640154,
VVTPLR,ph,T,244,true,"Lateral root-induction - NAA vs control",106,23328941,"MASCOT Score",23.0000000,,,,,,
GKSPERK,ph,S,382,true,"SnRK2 protein kinase substrates",85,23776212,XCorr,2.2500825,1.0000000,,,,0.025709299370646,
