Peptide,PTM,ModifiedAA,ModifiedPosition,PeptideUniqueToGene,ExperimentDesc,ExpID,PubmedID,ScoreType,IdentScore,LocProb,Log2FChange,PQ-val,QuantSig,PEP,MassErrorPPM
RAAAEKTVHDFTVKDIDGKDVALNKF,nta,R,72,true,"Arabidopsis translation initiation landscape - NTA",167a,35069635,,,,,,,,
RAAAEKTVHDFTVKDIDGKD,nta,R,72,true,"HUNTER N-terminome: legumain, GluC and trypsin",119,31951383,"MaxQuant score",,,,,,,
AAEKTVHDFTVKDID,nt,A,74,true,"HUNTER N-terminome: legumain, GluC and trypsin",119,31951383,"MaxQuant score",91.6570000,,,,,,
AAAEKTVHDFTVK,ac,K,77,true,"Histone deacetylases substrates - TSA vs control",98b,29061669,"MaxQuant Score",67.0000000,1.0000000,-0.1150000,0.9977001,NO,0.00025000001187436,
AAAEKTVHDFTVK,ac,K,77,true,"Histone deacetylases - hda14 vs WT (thylakoids)",98d,29061669,"MaxQuant Score",54.1000000,1.0000000,0.3640000,0.8072350,NO,0.00067899998975918,
TVHDFTVKDIDGK,ac,K,85,true,"Histone deacetylases - apicidin vs control",98a,29061669,"MaxQuant Score",135.0000000,1.0000000,-0.1390000,0.5701643,NO,2.1000000349769E-10,
TVHDFTVKDIDGK,ac,K,85,true,"Histone deacetylases substrates - TSA vs control",98b,29061669,"MaxQuant Score",135.0000000,1.0000000,0.3110000,0.9162205,NO,2.1000000349769E-10,
TVHDFTVKDIDGK,ac,K,85,true,"Histone deacetylases substrates - hda14 vs WT",98e,29061669,"MaxQuant Score",64.2000000,1.0000000,0.4630000,0.2897344,NO,0.00028000000747852,
TVHDFTVKDIDGK,ac,K,85,true,"Quantitative Acetylproteomics",101,29440448,,,,,,,,
DIDGKDVALNK,ac,K,90,true,"Histone deacetylases - apicidin vs control",98a,29061669,"MaxQuant Score",66.3000000,1.0000000,0.0870000,0.8203515,NO,0.0060000000521541,
DIDGKDVALNK,ac,K,90,true,"Histone deacetylases substrates - hda14 vs WT",98e,29061669,"MaxQuant Score",88.0000000,1.0000000,1.4870000,0.8511380,NO,1.8999999156222E-5,
DVALNKFK,ac,K,96,true,"Histone deacetylases substrates - TSA vs control",98b,29061669,"MaxQuant Score",106.0000000,1.0000000,0.3380000,0.8649679,NO,9.2000002060999E-10,
DVALNKFK,ac,K,96,true,"Quantitative Acetylproteomics",101,29440448,,,,,,,,
CGLTSSNYSELSHLYEK,acy,C,111,true,"Arabidopsis S-acylation atlas - Meristem",163a,35681017,,,,,,,,
CGLTSSNYSELSHLYEK,acy,C,111,true,"Arabidopsis S-acylation atlas - Leaf",163c,35681017,,,,,,,,
CGLTSSNYSELSHLYEK,ox,C,111,true,"SPEAR - 50 mM H2O2 / mock",138b,34619326,,,,1.8102114,0.0000223,YES,,
CGLTSSNYSELSHLYEK,sno,C,111,true,"Site-specific nitrosomeproteomic id - gsnor1-3",90b,25699590,XCorr,3.9000000,,,,,1.5260000509443E-5,-5.2900000
CGLTSSNYSELSHLYEK,sno,C,111,true,"hot5-4 / wildtype, FAT-switch S-nitrosoproteome",169,37277371,,,,-0.8751077,0.0146179,YES,,
GLTSSNYSE,nt,G,112,false,"Arg/N-end rule seed, prt6 vs. Wt",99,29168982,"MASCOT Score",30.9500000,,-0.2791707,0.1921773,NO,0.013410000130534,-0.9497162
CGLTSSNYSELSHLYEKYK,ac,K,127,true,"Histone deacetylases substrates - TSA vs control",98b,29061669,"MaxQuant Score",47.1000000,1.0000000,2.2270000,0.6251727,NO,0.00025000001187436,
NQFGFQEPGSNSE,nt,N,141,true,"Arg/N-end rule seed, prt6 vs. Wt",99,29168982,"MASCOT Score",33.8400000,,-0.8567898,0.0614574,NO,0.00064039998687804,-2.2979034
QFGFQEPGSN,nt,Q,142,true,"HUNTER N-terminome: legumain, GluC and trypsin",119,31951383,"MaxQuant score",103.5500000,,,,,,
QFACTR,sno,C,159,false,"hot5-4 / wildtype, FAT-switch S-nitrosoproteome",169,37277371,,,,-0.9900243,0.0037934,YES,,
FKAEFPIFDK,ac,K,163,false,"Histone deacetylases - apicidin vs control",98a,29061669,"MaxQuant Score",83.2000000,1.0000000,0.5170000,0.2123244,NO,0.00076000002445653,
VDVNGPSTAPIYEFLK,ph,S,178,true,"SIRK1 phosphorylation",86a,23820729,"MaxQuant Score",64.8660000,0.9460000,,,,1.7829999923706,3.5890000
VDVNGPSTAPIYEFLK,ph,S,178,true,"SIRK1 exp - sirk1 mutant vs WT",86b,23820729,,,,-1.2473854,,NO,,
VDVNGPSTAPIYEFLK,ph,S,178,true,"SIRK1 exp - 35S:SIRK1 vs WT",86c,23820729,,,,0.1621773,,NO,,
YPPTTSPFQIEKDIQK,ac,K,228,false,"Histone deacetylases - apicidin vs control",98a,29061669,"MaxQuant Score",142.5000000,1.0000000,0.0970000,0.7638358,NO,9.5000004321631E-25,
YPPTTSPFQIEKDIQK,ac,K,228,false,"Histone deacetylases substrates - hda14 vs WT",98e,29061669,"MaxQuant Score",142.9000000,1.0000000,0.0260000,0.9705100,NO,9.9492190967062E-44,
YPPTTSPFQIEKDIQK,ac,K,228,false,"Quantitative Acetylproteomics",101,29440448,,,,,,,,
