Peptide,PTM,ModifiedAA,ModifiedPosition,PeptideUniqueToGene,ExperimentDesc,ExpID,PubmedID,ScoreType,IdentScore,LocProb,Log2FChange,PQ-val,QuantSig,PEP,MassErrorPPM
MEFTAEQLSQYNGTDESKPIYVAIKGR,nta,M,1,true,"Arg/N-end rule pathway Roots",80,25728785,"MASCOT Score",100.4300000,,,,,4.3089999053336E-6,
MEFTAEQLSQYNGTDESKPIYVAIKGR,nta,M,1,true,"N-terminal ChaFRADIC",92,26010716,"MASCOT Score",28.9900000,,,,,7.9170000333306E-8,
MEFTAEQLSQYNGTDESKPIYVAIKGR,nta,M,1,true,"Stromal N-terminome",96,26371235,"MASCOT Score",91.4700000,,,,,,
MEFTAEQLSQYNGTDESKPIYVAIKGR,nta,M,1,true,"HUNTER N-terminome: legumain, GluC and trypsin",119,31951383,"MaxQuant score",72.5840000,,,,,,
MEFTAEQLSQYNGTDESKPIYVAIKGR,nta,M,1,true,"Arabidopsis translation initiation landscape - NTA",167a,35069635,,,,,,,,
MEFTAEQLSQYNGTDESKPIYVAIK,nta,M,1,true,"Characterization plant N-terminal acetylation",6,22223895,"MASCOT Score",53.3100000,,,,,,
MEFTAEQLSQYN,nta,M,1,true,"HUNTER N-terminome: legumain, GluC and trypsin",119,31951383,"MaxQuant score",129.1600000,,,,,,
MEFTAEQLSQ,nta,M,1,true,"N-term acetylation drought responses",5,26184543,,,,,,,,
MEFTAEQLSQYNGTDESKPIYVAIK,ph,T,4,true,"Lateral root-induction - NAA vs control",106,23328941,"MASCOT Score",36.0000000,,,,,,
VFDVTTGKSFYGSGGDYSMFAGK,ub,K,35,true,"upl3 mutant / wildtype",168,35926874,"MaxQuant score",85.2240000,1.0000000,0.1096949,0.8420800,NO,4.4854598257871E-8,-1.4580000
SFYGSGGDYSMFAGK,ph,S,36,true,"Tissue atlas Arabidopsis - ProteomicsDB",114,32188942,"MaxQuant score",119.9600000,0.9999970,,,,9.9794795005437E-7,
SFYGSGGDYSMFAGK,ph,S,40,true,"Tissue atlas Arabidopsis - ProteomicsDB",114,32188942,"MaxQuant score",91.6570000,0.9962580,,,,2.4088600184768E-5,
SFYGSGGDYSMFAGK,mox,M,46,true,"cat2 Methionine oxidation - 1h stress",62a,25693801,"MASCOT Score",97.0000000,,0.1233166,,NO,,
MSKNEEDVSPSLEGLTEK,ac,K,61,true,"Quantitative Acetylproteomics",101,29440448,,,,,,,,
MSKNEEDVSPSLEGLTEK,ub,K,61,true,"upl3 mutant / wildtype",168,35926874,"MaxQuant score",84.2080000,1.0000000,-0.7466158,0.1882190,NO,3.9741498767398E-6,1.1041000
MSKNEEDVSPSLEGLTEK,ph,S,67,true,"Large-scale phosphorylation discovery",44,23111157,XCorr,2.7440000,,,,,,
NEEDVSPSLEGLTEK,ph,S,67,true,"Large-scale phosphorylation discovery",44,23111157,XCorr,5.2020000,,,,,,
NEEDVSPSLEGLTEK,ph,S,67,true,"Tyrosine phosphorylation in Arabidopsis",59,18463617,"MASCOT Score",21.0000000,,,,,,-0.3476782
NEEDVSPSLEGLTEK,ph,S,67,true,"srk2dei ABA signaling phopshoproteomics",83,23572148,"MASCOT Score",82.0000000,,,,,,0.0009000
NEEDVSPSLEGLTEK,ph,S,67,true,"SnRK2 protein kinase substrates",85,23776212,XCorr,3.4674168,0.9990000,,,,4.1142899931401E-7,
NEEDVSPSLEGLTEK,ph,S,67,true,"atm and atr DNA damage response",88,25561503,"MASCOT Score",40.0000000,0.9970000,,,,,0.0600000
NEEDVSPSLEGLTEK,ph,S,67,true,"Lateral root-induction - NAA vs control",106,23328941,"MASCOT Score",36.0000000,,0.1697448,0.5376768,NO,,
NEEDVSPSLEGLTEK,ph,S,67,true,"Tissue atlas Arabidopsis - ProteomicsDB",114,32188942,"MaxQuant score",289.8700000,0.9999980,,,,0,
NEEDVSPSLEGLTEK,ph,S,69,true,"srk2dei ABA signaling phopshoproteomics",83,23572148,"MASCOT Score",48.0000000,,,,,,0.0011000
EINTLNDWETKFEAK,ub,K,87,true,"upl3 mutant / wildtype",168,35926874,"MaxQuant score",108.9700000,1.0000000,0.8960781,,,5.347299847358E-8,0.3823600
FEAKYPVVGR,ac,K,91,true,"Histone deacetylases substrates - TSA vs control",98b,29061669,"MaxQuant Score",81.0000000,1.0000000,0.5790000,0.7550922,NO,0.00031999999191612,
FEAKYPVVGR,ac,K,91,true,"Histone deacetylases substrates - hda14 vs WT",98e,29061669,"MaxQuant Score",93.1000000,1.0000000,-0.0980000,0.9289664,NO,1.900000029309E-6,
FEAKYPVVGR,ub,K,91,true,"upl3 mutant / wildtype",168,35926874,"MaxQuant score",123.7500000,1.0000000,0.4016305,0.2648200,NO,5.9272799262544E-5,1.3869000
