Peptide,PTM,ModifiedAA,ModifiedPosition,PeptideUniqueToGene,ExperimentDesc,ExpID,PubmedID,ScoreType,IdentScore,LocProb,Log2FChange,PQ-val,QuantSig,PEP,MassErrorPPM
TGTLTLNK,ph,T,317,false,"Tissue atlas Arabidopsis - ProteomicsDB",114,32188942,"MaxQuant score",123.4200000,0.9975070,,,,0.0081411302089691,
MITGDQLAIGK,ph,T,493,false,"Phosphorylation Early Elicitor Signaling",23,17317660,,,,,,,,
HICGMTGDGVNDAPALK,sno,C,565,false,"hot5-4 / wildtype, FAT-switch S-nitrosoproteome",169,37277371,,,,,,,,
TLHGLQPAEK,ph,T,863,true,"atm and atr DNA damage response",88,25561503,"MASCOT Score",22.0000000,1.0000000,,,,,-1.7300000
GHVESVVK,ph,S,913,false,"Pollen phosphoproteome Arabidopsis",43,22631563,"MASCOT Score",44.3900000,,,,,,-0.4803930
GHVESVVK,ph,S,913,false,"atm and atr DNA damage response",88,25561503,"MASCOT Score",35.0000000,1.0000000,,,,,-3.1400000
GHVESVVK,ph,S,913,false,"TOR Kinase and ABA Receptor",100,29290610,XCorr,2.6575863,1.0000000,,,,0.074850000441074,
GHVESVVK,ph,S,913,false,"Tissue atlas Arabidopsis - ProteomicsDB",114,32188942,"MaxQuant score",169.9300000,1.0000000,,,,0.00052241201046854,
GHVESVVKLK,ac,K,916,false,"Quantitative Acetylproteomics",101,29440448,,,,,,,,
GHVESVVKLK,ub,K,916,false,"Ubiquitination Membrane Proteins",120,33585938,,,,,,,,
GHVESVVKLK,ub,K,916,false,"upl3 mutant / wildtype",168,35926874,"MaxQuant score",159.8300000,1.0000000,0.6415460,0.4615400,NO,3.9782198655303E-6,-0.4116900
